BDBM50405528 CHEMBL7250
SMILES: CC(C)NCC(O)COc1ccc(CCOC2CCCCC2)cc1
InChI Key: InChIKey=PDZZIEFEMVIIPQ-UHFFFAOYSA-N
Data: 1 Kd
Activity Spreadsheet -- Enzyme Inhibition Constant Data from BindingDB
Found 1 hit for monomerid = 50405528
Trg + Lig
Ki
nM
ΔG°
kcal/mole
IC50
nM
Kd
nM
EC50/IC50
nM
koff
s-1
kon
M-1s-1
pHTemp
°C
Beta-1 adrenergic receptor
(Rattus norvegicus (Rat))
BDBM50405528
(CHEMBL7250)
Show SMILES CC(C)NCC(O)COc1ccc(CCOC2CCCCC2)cc1
Show InChI InChI=1S/C20H33NO3/c1-16(2)21-14-18(22)15-24-20-10-8-17(9-11-20)12-13-23-19-6-4-3-5-7-19/h8-11,16,18-19,21-22H,3-7,12-15H2,1-2H3
Reactome pathway
n/an/an/a 5.89n/an/an/an/an/a
TBA
Curated by ChEMBL
Assay Description
Antagonist activity was determined against beta-1 adrenergic receptor in spontaneously beating rat atria
J Med Chem 30: 1003-11 (1987)
BindingDB Entry DOI: 10.7270/Q2251KC9