BDBM50405547 CHEMBL18432
SMILES: Cc1c[n+](CCO)ccc1\C=C\c1cccc2ccccc12
InChI Key: InChIKey=NYMQICTYJFOFOK-MDZDMXLPSA-N
Data: 2 IC50
Activity Spreadsheet -- Enzyme Inhibition Constant Data from BindingDB
Found 2 hits for monomerid = 50405547
Trg + Lig
Ki
nM
ΔG°
kcal/mole
IC50
nM
Kd
nM
EC50/IC50
nM
koff
s-1
kon
M-1s-1
pHTemp
°C
Choline Acetyltransferase
(RAT)
BDBM50405547
(CHEMBL18432)
Show SMILES Cc1c[n+](CCO)ccc1\C=C\c1cccc2ccccc12
Show InChI InChI=1S/C20H20NO/c1-16-15-21(13-14-22)12-11-17(16)9-10-19-7-4-6-18-5-2-3-8-20(18)19/h2-12,15,22H,13-14H2,1H3/q+1/b10-9+
n/an/a 1.70E+3n/an/an/an/an/an/a
University of Pittsburgh
Curated by ChEMBL
Assay Description
Inhibition of choline acetyltransferase (ChAT) activity
J Med Chem 31: 117-21 (1988)
BindingDB Entry DOI: 10.7270/Q2XD12VJ
Acetylcholinesterase
(Rattus norvegicus (rat))
BDBM50405547
(CHEMBL18432)
Show SMILES Cc1c[n+](CCO)ccc1\C=C\c1cccc2ccccc12
Show InChI InChI=1S/C20H20NO/c1-16-15-21(13-14-22)12-11-17(16)9-10-19-7-4-6-18-5-2-3-8-20(18)19/h2-12,15,22H,13-14H2,1H3/q+1/b10-9+
n/an/a 2.70E+4n/an/an/an/an/an/a
University of Pittsburgh
Curated by ChEMBL
Assay Description
Inhibition of acetylcholinesterase (AChE) activity
J Med Chem 31: 117-21 (1988)
BindingDB Entry DOI: 10.7270/Q2XD12VJ