BDBM50405557 CHEMBL19325
SMILES: Cc1c[n+](CC(N)=O)ccc1\C=C\c1cccc2ccccc12
InChI Key: InChIKey=UWAIEWBPAPCNJN-MDZDMXLPSA-O
Data: 2 IC50
Activity Spreadsheet -- Enzyme Inhibition Constant Data from BindingDB
Found 2 hits for monomerid = 50405557
Trg + Lig
Ki
nM
ΔG°
kcal/mole
IC50
nM
Kd
nM
EC50/IC50
nM
koff
s-1
kon
M-1s-1
pHTemp
°C
Choline Acetyltransferase
(RAT)
BDBM50405557
(CHEMBL19325)
Show SMILES Cc1c[n+](CC(N)=O)ccc1\C=C\c1cccc2ccccc12
Show InChI InChI=1S/C20H18N2O/c1-15-13-22(14-20(21)23)12-11-16(15)9-10-18-7-4-6-17-5-2-3-8-19(17)18/h2-13H,14H2,1H3,(H-,21,23)/p+1/b10-9+
n/an/a 340n/an/an/an/an/an/a
University of Pittsburgh
Curated by ChEMBL
Assay Description
Inhibition of choline acetyltransferase (ChAT) activity
J Med Chem 31: 117-21 (1988)
BindingDB Entry DOI: 10.7270/Q2XD12VJ
Acetylcholinesterase
(Rattus norvegicus (rat))
BDBM50405557
(CHEMBL19325)
Show SMILES Cc1c[n+](CC(N)=O)ccc1\C=C\c1cccc2ccccc12
Show InChI InChI=1S/C20H18N2O/c1-15-13-22(14-20(21)23)12-11-16(15)9-10-18-7-4-6-17-5-2-3-8-19(17)18/h2-13H,14H2,1H3,(H-,21,23)/p+1/b10-9+
n/an/a 4.50E+4n/an/an/an/an/an/a
University of Pittsburgh
Curated by ChEMBL
Assay Description
Inhibition of acetylcholinesterase (AChE) activity
J Med Chem 31: 117-21 (1988)
BindingDB Entry DOI: 10.7270/Q2XD12VJ