BDBM50405650 CHEMBL37061
SMILES: Nc1nc(N)c2c(Cl)c(CNc3ccc(cc3)C(=O)NC(CCC(O)=O)C(O)=O)ccc2n1
InChI Key: InChIKey=PFAJRSFHQCUKQB-UHFFFAOYSA-N
Data: 2 IC50
Activity Spreadsheet -- Enzyme Inhibition Constant Data from BindingDB
Found 2 hits for monomerid = 50405650
Trg + Lig
Ki
nM
ΔG°
kcal/mole
IC50
nM
Kd
nM
EC50/IC50
nM
koff
s-1
kon
M-1s-1
pHTemp
°C
Thymidylate synthase
(Mus musculus)
BDBM50405650
(CHEMBL37061)
Show SMILES Nc1nc(N)c2c(Cl)c(CNc3ccc(cc3)C(=O)NC(CCC(O)=O)C(O)=O)ccc2n1
Show InChI InChI=1S/C21H21ClN6O5/c22-17-11(3-6-13-16(17)18(23)28-21(24)27-13)9-25-12-4-1-10(2-5-12)19(31)26-14(20(32)33)7-8-15(29)30/h1-6,14,25H,7-9H2,(H,26,31)(H,29,30)(H,32,33)(H4,23,24,27,28)
Reactome pathway
n/an/a 190n/an/an/an/an/an/a
Medical University of South Carolina
Curated by ChEMBL
Assay Description
Inhibitory activity against thymidylate synthase isolated from L1210 leukemia cells
J Med Chem 31: 449-54 (1988)
BindingDB Entry DOI: 10.7270/Q2DF6SD0
Dihydrofolate reductase
(Homo sapiens (Human))
BDBM50405650
(CHEMBL37061)
Show SMILES Nc1nc(N)c2c(Cl)c(CNc3ccc(cc3)C(=O)NC(CCC(O)=O)C(O)=O)ccc2n1
Show InChI InChI=1S/C21H21ClN6O5/c22-17-11(3-6-13-16(17)18(23)28-21(24)27-13)9-25-12-4-1-10(2-5-12)19(31)26-14(20(32)33)7-8-15(29)30/h1-6,14,25H,7-9H2,(H,26,31)(H,29,30)(H,32,33)(H4,23,24,27,28)
NCI pathway
Reactome pathway
n/an/a 3.80n/an/an/an/an/an/a
Medical University of South Carolina
Curated by ChEMBL
Assay Description
Inhibitory activity against dihydrofolate reductase (DHFR) obtained from human WIL2 cells
J Med Chem 31: 449-54 (1988)
BindingDB Entry DOI: 10.7270/Q2DF6SD0