BDBM50405739 CHEMBL168616
SMILES: Cc1ccccc1CNCCCCCCNCCCCCCCCNCCCCCCNCc1ccccc1C
InChI Key: InChIKey=LJAHWUCLDQXGRN-UHFFFAOYSA-N
Data: 2 Kd
Activity Spreadsheet -- Enzyme Inhibition Constant Data from BindingDB
Found 2 hits for monomerid = 50405739
Trg + Lig
Ki
nM
ΔG°
kcal/mole
IC50
nM
Kd
nM
EC50/IC50
nM
koff
s-1
kon
M-1s-1
pHTemp
°C
Muscarinic acetylcholine receptor M2
(Homo sapiens (Human))
BDBM50405739
(CHEMBL168616)
Show SMILES Cc1ccccc1CNCCCCCCNCCCCCCCCNCCCCCCNCc1ccccc1C
Show InChI InChI=1S/C36H62N4/c1-33-21-11-13-23-35(33)31-39-29-19-9-7-17-27-37-25-15-5-3-4-6-16-26-38-28-18-8-10-20-30-40-32-36-24-14-12-22-34(36)2/h11-14,21-24,37-40H,3-10,15-20,25-32H2,1-2H3
n/an/an/a 58.9n/an/an/an/an/a
University of Camerino
Curated by ChEMBL
Assay Description
Antagonist potency against carbachol induced inhibition of electrically stimulated guinea pig atria Muscarinic acetylcholine receptor
J Med Chem 32: 79-84 (1989)
BindingDB Entry DOI: 10.7270/Q2N017RN
Muscarinic acetylcholine receptor M3
(Cavia porcellus)
BDBM50405739
(CHEMBL168616)
Show SMILES Cc1ccccc1CNCCCCCCNCCCCCCCCNCCCCCCNCc1ccccc1C
Show InChI InChI=1S/C36H62N4/c1-33-21-11-13-23-35(33)31-39-29-19-9-7-17-27-37-25-15-5-3-4-6-16-26-38-28-18-8-10-20-30-40-32-36-24-14-12-22-34(36)2/h11-14,21-24,37-40H,3-10,15-20,25-32H2,1-2H3
Reactome pathway
n/an/an/a 2.00E+3n/an/an/an/an/a
University of Camerino
Curated by ChEMBL
Assay Description
Antagonist potency against carbachol induced contractions of isolated guinea pig ileum Muscarinic acetylcholine receptor
J Med Chem 32: 79-84 (1989)
BindingDB Entry DOI: 10.7270/Q2N017RN