BDBM50405743 CHEMBL166232
SMILES: C(CCCCNCCCCCCNCc1ccccc1)CCCNCCCCCCNCc1ccccc1
InChI Key: InChIKey=BTBQFAQETBWIOC-UHFFFAOYSA-N
Data: 2 Kd
Activity Spreadsheet -- Enzyme Inhibition Constant Data from BindingDB
Found 2 hits for monomerid = 50405743
Trg + Lig
Ki
nM
ΔG°
kcal/mole
IC50
nM
Kd
nM
EC50/IC50
nM
koff
s-1
kon
M-1s-1
pHTemp
°C
Muscarinic acetylcholine receptor M2
(Homo sapiens (Human))
BDBM50405743
(CHEMBL166232)
Show SMILES C(CCCCNCCCCCCNCc1ccccc1)CCCNCCCCCCNCc1ccccc1
Show InChI InChI=1S/C34H58N4/c1(3-15-25-35-27-17-5-7-19-29-37-31-33-21-11-9-12-22-33)2-4-16-26-36-28-18-6-8-20-30-38-32-34-23-13-10-14-24-34/h9-14,21-24,35-38H,1-8,15-20,25-32H2
n/an/an/a 83.2n/an/an/an/an/a
University of Camerino
Curated by ChEMBL
Assay Description
Antagonist potency against carbachol induced inhibition of electrically stimulated guinea pig atria Muscarinic acetylcholine receptor
J Med Chem 32: 79-84 (1989)
BindingDB Entry DOI: 10.7270/Q2N017RN
Muscarinic acetylcholine receptor M3
(Cavia porcellus)
BDBM50405743
(CHEMBL166232)
Show SMILES C(CCCCNCCCCCCNCc1ccccc1)CCCNCCCCCCNCc1ccccc1
Show InChI InChI=1S/C34H58N4/c1(3-15-25-35-27-17-5-7-19-29-37-31-33-21-11-9-12-22-33)2-4-16-26-36-28-18-6-8-20-30-38-32-34-23-13-10-14-24-34/h9-14,21-24,35-38H,1-8,15-20,25-32H2
Reactome pathway
n/an/an/a 2.19E+3n/an/an/an/an/a
University of Camerino
Curated by ChEMBL
Assay Description
Antagonist potency against carbachol induced contractions of isolated guinea pig ileum Muscarinic acetylcholine receptor
J Med Chem 32: 79-84 (1989)
BindingDB Entry DOI: 10.7270/Q2N017RN