BDBM50405745 CHEMBL168736
SMILES: COc1ccccc1CNCCCCCNCCCCCCCCNCCCCCNCc1ccccc1OC
InChI Key: InChIKey=IHUYQUZQJOVHAF-UHFFFAOYSA-N
Data: 2 Kd
Activity Spreadsheet -- Enzyme Inhibition Constant Data from BindingDB
Found 2 hits for monomerid = 50405745
Trg + Lig
Ki
nM
ΔG°
kcal/mole
IC50
nM
Kd
nM
EC50/IC50
nM
koff
s-1
kon
M-1s-1
pHTemp
°C
Muscarinic acetylcholine receptor M2
(Homo sapiens (Human))
BDBM50405745
(CHEMBL168736)
Show SMILES COc1ccccc1CNCCCCCNCCCCCCCCNCCCCCNCc1ccccc1OC
Show InChI InChI=1S/C34H58N4O2/c1-39-33-21-11-9-19-31(33)29-37-27-17-7-15-25-35-23-13-5-3-4-6-14-24-36-26-16-8-18-28-38-30-32-20-10-12-22-34(32)40-2/h9-12,19-22,35-38H,3-8,13-18,23-30H2,1-2H3
n/an/an/a 162n/an/an/an/an/a
University of Camerino
Curated by ChEMBL
Assay Description
Antagonist potency against carbachol induced inhibition of electrically stimulated guinea pig atria Muscarinic acetylcholine receptor
J Med Chem 32: 79-84 (1989)
BindingDB Entry DOI: 10.7270/Q2N017RN
Muscarinic acetylcholine receptor M3
(Cavia porcellus)
BDBM50405745
(CHEMBL168736)
Show SMILES COc1ccccc1CNCCCCCNCCCCCCCCNCCCCCNCc1ccccc1OC
Show InChI InChI=1S/C34H58N4O2/c1-39-33-21-11-9-19-31(33)29-37-27-17-7-15-25-35-23-13-5-3-4-6-14-24-36-26-16-8-18-28-38-30-32-20-10-12-22-34(32)40-2/h9-12,19-22,35-38H,3-8,13-18,23-30H2,1-2H3
Reactome pathway
n/an/an/a 2.46E+3n/an/an/an/an/a
University of Camerino
Curated by ChEMBL
Assay Description
Antagonist potency against carbachol induced contractions of isolated guinea pig ileum Muscarinic acetylcholine receptor
J Med Chem 32: 79-84 (1989)
BindingDB Entry DOI: 10.7270/Q2N017RN