BDBM50405747 CHEMBL168304
SMILES: Cc1ccc(CNCCCCCCNCCCCCCCCNCCCCCCNCc2ccc(C)cc2)cc1
InChI Key: InChIKey=AODIREMJPSRUGT-UHFFFAOYSA-N
Data: 2 Kd
Activity Spreadsheet -- Enzyme Inhibition Constant Data from BindingDB
Found 2 hits for monomerid = 50405747
Trg + Lig
Ki
nM
ΔG°
kcal/mole
IC50
nM
Kd
nM
EC50/IC50
nM
koff
s-1
kon
M-1s-1
pHTemp
°C
Muscarinic acetylcholine receptor M2
(Homo sapiens (Human))
BDBM50405747
(CHEMBL168304)
Show SMILES Cc1ccc(CNCCCCCCNCCCCCCCCNCCCCCCNCc2ccc(C)cc2)cc1
Show InChI InChI=1S/C36H62N4/c1-33-17-21-35(22-18-33)31-39-29-15-9-7-13-27-37-25-11-5-3-4-6-12-26-38-28-14-8-10-16-30-40-32-36-23-19-34(2)20-24-36/h17-24,37-40H,3-16,25-32H2,1-2H3
n/an/an/a 166n/an/an/an/an/a
University of Camerino
Curated by ChEMBL
Assay Description
Antagonist potency against carbachol induced inhibition of electrically stimulated guinea pig atria Muscarinic acetylcholine receptor
J Med Chem 32: 79-84 (1989)
BindingDB Entry DOI: 10.7270/Q2N017RN
Muscarinic acetylcholine receptor M3
(Cavia porcellus)
BDBM50405747
(CHEMBL168304)
Show SMILES Cc1ccc(CNCCCCCCNCCCCCCCCNCCCCCCNCc2ccc(C)cc2)cc1
Show InChI InChI=1S/C36H62N4/c1-33-17-21-35(22-18-33)31-39-29-15-9-7-13-27-37-25-11-5-3-4-6-12-26-38-28-14-8-10-16-30-40-32-36-23-19-34(2)20-24-36/h17-24,37-40H,3-16,25-32H2,1-2H3
Reactome pathway
n/an/an/a 2.34E+3n/an/an/an/an/a
University of Camerino
Curated by ChEMBL
Assay Description
Antagonist potency against carbachol induced contractions of isolated guinea pig ileum Muscarinic acetylcholine receptor
J Med Chem 32: 79-84 (1989)
BindingDB Entry DOI: 10.7270/Q2N017RN