null
SMILES: Clc1ccccc1CNCCCCCCNCCCCCCCCNCCCCCCNCc1ccccc1Cl
InChI Key: InChIKey=SGDRDLKBLDVTOF-UHFFFAOYSA-N
Activity Spreadsheet -- Enzyme Inhibition Constant Data from BindingDB
Found 2 hits for monomerid = 50405751
Trg + Lig
Ki
nM
ΔG°
kcal/mole
IC50
nM
Kd
nM
EC50/IC50
nM
koff
s-1
kon
M-1s-1
pHTemp
°C
Muscarinic acetylcholine receptor M2
(Homo sapiens (Human))
BDBM50405751
(CHEMBL165700)
Show SMILES Clc1ccccc1CNCCCCCCNCCCCCCCCNCCCCCCNCc1ccccc1Cl
Show InChI InChI=1S/C34H56Cl2N4/c35-33-21-11-9-19-31(33)29-39-27-17-7-5-15-25-37-23-13-3-1-2-4-14-24-38-26-16-6-8-18-28-40-30-32-20-10-12-22-34(32)36/h9-12,19-22,37-40H,1-8,13-18,23-30H2
n/an/an/a 66.1n/an/an/an/an/a
University of Camerino
Curated by ChEMBL
Assay Description
Antagonist potency against carbachol induced inhibition of electrically stimulated guinea pig atria Muscarinic acetylcholine receptor
J Med Chem 32: 79-84 (1989)
BindingDB Entry DOI: 10.7270/Q2N017RN
Muscarinic acetylcholine receptor
(Cavia porcellus)
BDBM50405751
(CHEMBL165700)
Show SMILES Clc1ccccc1CNCCCCCCNCCCCCCCCNCCCCCCNCc1ccccc1Cl
Show InChI InChI=1S/C34H56Cl2N4/c35-33-21-11-9-19-31(33)29-39-27-17-7-5-15-25-37-23-13-3-1-2-4-14-24-38-26-16-6-8-18-28-40-30-32-20-10-12-22-34(32)36/h9-12,19-22,37-40H,1-8,13-18,23-30H2
Reactome pathway
n/an/an/a 2.82E+3n/an/an/an/an/a
University of Camerino
Curated by ChEMBL
Assay Description
Antagonist potency against carbachol induced contractions of isolated guinea pig ileum Muscarinic acetylcholine receptor
J Med Chem 32: 79-84 (1989)
BindingDB Entry DOI: 10.7270/Q2N017RN