null
SMILES: Clc1ccc(CNCCCCCCNCCCCCCCCNCCCCCCNCc2ccc(Cl)cc2)cc1
InChI Key: InChIKey=RKXRKRPDZVBZTI-UHFFFAOYSA-N
Activity Spreadsheet -- Enzyme Inhibition Constant Data from BindingDB
Found 2 hits for monomerid = 50405753
Trg + Lig
Ki
nM
ΔG°
kcal/mole
IC50
nM
Kd
nM
EC50/IC50
nM
koff
s-1
kon
M-1s-1
pHTemp
°C
Muscarinic acetylcholine receptor M2
(Homo sapiens (Human))
BDBM50405753
(CHEMBL170113)
Show SMILES Clc1ccc(CNCCCCCCNCCCCCCCCNCCCCCCNCc2ccc(Cl)cc2)cc1
Show InChI InChI=1S/C34H56Cl2N4/c35-33-19-15-31(16-20-33)29-39-27-13-7-5-11-25-37-23-9-3-1-2-4-10-24-38-26-12-6-8-14-28-40-30-32-17-21-34(36)22-18-32/h15-22,37-40H,1-14,23-30H2
n/an/an/a 178n/an/an/an/an/a
University of Camerino
Curated by ChEMBL
Assay Description
Antagonist potency against carbachol induced inhibition of electrically stimulated guinea pig atria Muscarinic acetylcholine receptor
J Med Chem 32: 79-84 (1989)
BindingDB Entry DOI: 10.7270/Q2N017RN
Muscarinic acetylcholine receptor
(Cavia porcellus)
BDBM50405753
(CHEMBL170113)
Show SMILES Clc1ccc(CNCCCCCCNCCCCCCCCNCCCCCCNCc2ccc(Cl)cc2)cc1
Show InChI InChI=1S/C34H56Cl2N4/c35-33-19-15-31(16-20-33)29-39-27-13-7-5-11-25-37-23-9-3-1-2-4-10-24-38-26-12-6-8-14-28-40-30-32-17-21-34(36)22-18-32/h15-22,37-40H,1-14,23-30H2
Reactome pathway
n/an/an/a 2.34E+3n/an/an/an/an/a
University of Camerino
Curated by ChEMBL
Assay Description
Antagonist potency against carbachol induced contractions of isolated guinea pig ileum Muscarinic acetylcholine receptor
J Med Chem 32: 79-84 (1989)
BindingDB Entry DOI: 10.7270/Q2N017RN