BDBM50405760 CHEMBL167690
SMILES: COc1ccccc1CNCCCCCCNCCCCCCCCCCCNCCCCCCNCc1ccccc1OC
InChI Key: InChIKey=RCTJSCHQMCXTLO-UHFFFAOYSA-N
Data: 2 Kd
Activity Spreadsheet -- Enzyme Inhibition Constant Data from BindingDB
Found 2 hits for monomerid = 50405760
Trg + Lig
Ki
nM
ΔG°
kcal/mole
IC50
nM
Kd
nM
EC50/IC50
nM
koff
s-1
kon
M-1s-1
pHTemp
°C
Muscarinic acetylcholine receptor M2
(Homo sapiens (Human))
BDBM50405760
(CHEMBL167690)
Show SMILES COc1ccccc1CNCCCCCCNCCCCCCCCCCCNCCCCCCNCc1ccccc1OC
Show InChI InChI=1S/C39H68N4O2/c1-44-38-26-16-14-24-36(38)34-42-32-22-12-10-20-30-40-28-18-8-6-4-3-5-7-9-19-29-41-31-21-11-13-23-33-43-35-37-25-15-17-27-39(37)45-2/h14-17,24-27,40-43H,3-13,18-23,28-35H2,1-2H3
n/an/an/a 37.1n/an/an/an/an/a
University of Camerino
Curated by ChEMBL
Assay Description
Antagonist potency against carbachol induced inhibition of electrically stimulated guinea pig atria Muscarinic acetylcholine receptor
J Med Chem 32: 79-84 (1989)
BindingDB Entry DOI: 10.7270/Q2N017RN
Muscarinic acetylcholine receptor M3
(Cavia porcellus)
BDBM50405760
(CHEMBL167690)
Show SMILES COc1ccccc1CNCCCCCCNCCCCCCCCCCCNCCCCCCNCc1ccccc1OC
Show InChI InChI=1S/C39H68N4O2/c1-44-38-26-16-14-24-36(38)34-42-32-22-12-10-20-30-40-28-18-8-6-4-3-5-7-9-19-29-41-31-21-11-13-23-33-43-35-37-25-15-17-27-39(37)45-2/h14-17,24-27,40-43H,3-13,18-23,28-35H2,1-2H3
Reactome pathway
n/an/an/a 2.29E+3n/an/an/an/an/a
University of Camerino
Curated by ChEMBL
Assay Description
Antagonist potency against carbachol induced contractions of isolated guinea pig ileum Muscarinic acetylcholine receptor
J Med Chem 32: 79-84 (1989)
BindingDB Entry DOI: 10.7270/Q2N017RN