BDBM50405845 CHEMBL82643
SMILES: NS(=O)(=O)c1nc2ccc(OC(=O)c3ccccc3)cc2s1
InChI Key: InChIKey=NIAKACXIACUKAT-UHFFFAOYSA-N
Data: 1 IC50
Activity Spreadsheet -- Enzyme Inhibition Constant Data from BindingDB
Found 1 hit for monomerid = 50405845
Trg + Lig
Ki
nM
ΔG°
kcal/mole
IC50
nM
Kd
nM
EC50/IC50
nM
koff
s-1
kon
M-1s-1
pHTemp
°C
Carbonic anhydrase 2
(Homo sapiens (Human))
BDBM50405845
(CHEMBL82643)
Show SMILES NS(=O)(=O)c1nc2ccc(OC(=O)c3ccccc3)cc2s1
Show InChI InChI=1S/C14H10N2O4S2/c15-22(18,19)14-16-11-7-6-10(8-12(11)21-14)20-13(17)9-4-2-1-3-5-9/h1-8H,(H2,15,18,19)
Reactome pathway
n/an/a 8n/an/an/an/an/an/a
Merck Sharp& Dohme Research Laboratory
Curated by ChEMBL
Assay Description
In vitro inhibitory activity against human Carbonic anhydrase II
J Med Chem 32: 2486-92 (1989)
BindingDB Entry DOI: 10.7270/Q27P90KQ