BDBM50405958 CHEMBL31402
SMILES: COCCOc1ccc(Cc2cnc(N)nc2N)cc1OCCOC
InChI Key: InChIKey=LMMYDNOLGSNIBJ-UHFFFAOYSA-N
Data: 11 KI
Activity Spreadsheet -- Enzyme Inhibition Constant Data from BindingDB
Found 11 hits for monomerid = 50405958
Trg + Lig
Ki
nM
ΔG°
kcal/mole
IC50
nM
Kd
nM
EC50/IC50
nM
koff
s-1
kon
M-1s-1
pHTemp
°C
Dihydrofolate reductase
(Salmonella enterica subsp. enterica serovar Typhi)
BDBM50405958
(CHEMBL31402)
Show SMILES COCCOc1ccc(Cc2cnc(N)nc2N)cc1OCCOC
Show InChI InChI=1S/C17H24N4O4/c1-22-5-7-24-14-4-3-12(10-15(14)25-8-6-23-2)9-13-11-20-17(19)21-16(13)18/h3-4,10-11H,5-9H2,1-2H3,(H4,18,19,20,21)
60n/an/an/an/an/an/an/an/a
Pomona College
Curated by ChEMBL
Assay Description
Inhibitory activity against Escherichia coli dihydrofolate reductase
J Med Chem 34: 46-54 (1991)
BindingDB Entry DOI: 10.7270/Q2X92CH4
Dihydrofolate reductase
(Escherichia coli)
BDBM50405958
(CHEMBL31402)
Show SMILES COCCOc1ccc(Cc2cnc(N)nc2N)cc1OCCOC
Show InChI InChI=1S/C17H24N4O4/c1-22-5-7-24-14-4-3-12(10-15(14)25-8-6-23-2)9-13-11-20-17(19)21-16(13)18/h3-4,10-11H,5-9H2,1-2H3,(H4,18,19,20,21)
NCI pathway
Reactome pathway
60n/an/an/an/an/an/an/an/a
Beijing Medical University
Curated by ChEMBL
Assay Description
Apparent inhibitory (log 1/Ki) activity against Escherichia coli dihydrofolate reductase
J Med Chem 31: 366-70 (1988)
BindingDB Entry DOI: 10.7270/Q2BV7JTC
Dihydrofolate reductase
(Escherichia coli)
BDBM50405958
(CHEMBL31402)
Show SMILES COCCOc1ccc(Cc2cnc(N)nc2N)cc1OCCOC
Show InChI InChI=1S/C17H24N4O4/c1-22-5-7-24-14-4-3-12(10-15(14)25-8-6-23-2)9-13-11-20-17(19)21-16(13)18/h3-4,10-11H,5-9H2,1-2H3,(H4,18,19,20,21)
NCI pathway
Reactome pathway
60n/an/an/an/an/an/an/an/a
TBA
Curated by ChEMBL
Assay Description
Inhibitory activity against dihydrofolate reductase (DHFR) from Escherichia coli (expressed as log 1/Kiapp)
J Med Chem 25: 777-84 (1982)
BindingDB Entry DOI: 10.7270/Q2WH2S6T
Dihydrofolate reductase
(Escherichia coli)
BDBM50405958
(CHEMBL31402)
Show SMILES COCCOc1ccc(Cc2cnc(N)nc2N)cc1OCCOC
Show InChI InChI=1S/C17H24N4O4/c1-22-5-7-24-14-4-3-12(10-15(14)25-8-6-23-2)9-13-11-20-17(19)21-16(13)18/h3-4,10-11H,5-9H2,1-2H3,(H4,18,19,20,21)
NCI pathway
Reactome pathway
60.3n/an/an/an/an/an/an/an/a
Uniroyal Chemical Co., Inc.
Curated by ChEMBL
Assay Description
Inhibition constant against binding of Escherichia coli dihydrofolate reductase
J Med Chem 31: 1396-406 (1988)
BindingDB Entry DOI: 10.7270/Q2P55QQJ
Dihydrofolate reductase
(Lactobacillus casei)
BDBM50405958
(CHEMBL31402)
Show SMILES COCCOc1ccc(Cc2cnc(N)nc2N)cc1OCCOC
Show InChI InChI=1S/C17H24N4O4/c1-22-5-7-24-14-4-3-12(10-15(14)25-8-6-23-2)9-13-11-20-17(19)21-16(13)18/h3-4,10-11H,5-9H2,1-2H3,(H4,18,19,20,21)
309n/an/an/an/an/an/an/an/a
Pomona College
Curated by ChEMBL
Assay Description
Inhibitory activity against Lactobacillus casei dihydrofolate reductase
J Med Chem 32: 1895-905 (1989)
BindingDB Entry DOI: 10.7270/Q2QR4ZB9
Dihydrofolate reductase
(Lactobacillus casei)
BDBM50405958
(CHEMBL31402)
Show SMILES COCCOc1ccc(Cc2cnc(N)nc2N)cc1OCCOC
Show InChI InChI=1S/C17H24N4O4/c1-22-5-7-24-14-4-3-12(10-15(14)25-8-6-23-2)9-13-11-20-17(19)21-16(13)18/h3-4,10-11H,5-9H2,1-2H3,(H4,18,19,20,21)
309n/an/an/an/an/an/an/an/a
TBA
Curated by ChEMBL
Assay Description
Inhibition of Rap1A-mediated geranylgeranylation expressed in mouse NIH3T3 cells
J Med Chem 25: 777-84 (1982)
BindingDB Entry DOI: 10.7270/Q2WH2S6T
Dihydrofolate reductase
(Bos taurus (Cattle))
BDBM50405958
(CHEMBL31402)
Show SMILES COCCOc1ccc(Cc2cnc(N)nc2N)cc1OCCOC
Show InChI InChI=1S/C17H24N4O4/c1-22-5-7-24-14-4-3-12(10-15(14)25-8-6-23-2)9-13-11-20-17(19)21-16(13)18/h3-4,10-11H,5-9H2,1-2H3,(H4,18,19,20,21)
6.76E+3n/an/an/an/an/an/a7.2n/a
TBA
Curated by ChEMBL
Assay Description
Inhibitory activity against bovine liver Dihydrofolate reductase at pH 7.2.
J Med Chem 25: 435-40 (1982)
BindingDB Entry DOI: 10.7270/Q2DF6TDD
Dihydrofolate reductase
(Bos taurus (Cattle))
BDBM50405958
(CHEMBL31402)
Show SMILES COCCOc1ccc(Cc2cnc(N)nc2N)cc1OCCOC
Show InChI InChI=1S/C17H24N4O4/c1-22-5-7-24-14-4-3-12(10-15(14)25-8-6-23-2)9-13-11-20-17(19)21-16(13)18/h3-4,10-11H,5-9H2,1-2H3,(H4,18,19,20,21)
6.76E+3n/an/an/an/an/an/a7.2n/a
TBA
Curated by ChEMBL
Assay Description
Inhibitory activity against bovine liver Dihydrofolate reductase at pH 7.2.
J Med Chem 25: 435-40 (1982)
BindingDB Entry DOI: 10.7270/Q2DF6TDD
Dihydrofolate reductase
(Gallus gallus (Chicken))
BDBM50405958
(CHEMBL31402)
Show SMILES COCCOc1ccc(Cc2cnc(N)nc2N)cc1OCCOC
Show InChI InChI=1S/C17H24N4O4/c1-22-5-7-24-14-4-3-12(10-15(14)25-8-6-23-2)9-13-11-20-17(19)21-16(13)18/h3-4,10-11H,5-9H2,1-2H3,(H4,18,19,20,21)
Reactome pathway
1.23E+5n/an/an/an/an/an/a7.2n/a
TBA
Curated by ChEMBL
Assay Description
Inhibition of Wnt2/beta-catenin signaling in human A549 cells assessed as inhibition of cell proliferation after 48 hrs by MTT assay
J Med Chem 25: 435-40 (1982)
BindingDB Entry DOI: 10.7270/Q2DF6TDD
Dihydrofolate reductase
(Gallus gallus (Chicken))
BDBM50405958
(CHEMBL31402)
Show SMILES COCCOc1ccc(Cc2cnc(N)nc2N)cc1OCCOC
Show InChI InChI=1S/C17H24N4O4/c1-22-5-7-24-14-4-3-12(10-15(14)25-8-6-23-2)9-13-11-20-17(19)21-16(13)18/h3-4,10-11H,5-9H2,1-2H3,(H4,18,19,20,21)
Reactome pathway
1.23E+5n/an/an/an/an/an/an/an/a
Pomona College
Curated by ChEMBL
Assay Description
Inhibitory activity against chicken liver dihydrofolate reductase
J Med Chem 32: 1895-905 (1989)
BindingDB Entry DOI: 10.7270/Q2QR4ZB9
Dihydrofolate reductase
(Gallus gallus (Chicken))
BDBM50405958
(CHEMBL31402)
Show SMILES COCCOc1ccc(Cc2cnc(N)nc2N)cc1OCCOC
Show InChI InChI=1S/C17H24N4O4/c1-22-5-7-24-14-4-3-12(10-15(14)25-8-6-23-2)9-13-11-20-17(19)21-16(13)18/h3-4,10-11H,5-9H2,1-2H3,(H4,18,19,20,21)
Reactome pathway
1.23E+5n/an/an/an/an/an/a7.2n/a
TBA
Curated by ChEMBL
Assay Description
Inhibitory activity against chicken Dihydrofolate reductase at pH 7.2.
J Med Chem 25: 435-40 (1982)
BindingDB Entry DOI: 10.7270/Q2DF6TDD