BDBM50406196 CHEMBL335798
SMILES: CC(C)N(C(C)C)c1nc2cccc(C)c2c(=O)o1
InChI Key: InChIKey=BBBGTSQRTHOXEX-UHFFFAOYSA-N
Data: 1 KI  1 Koff  1 Kon
Activity Spreadsheet -- Enzyme Inhibition Constant Data from BindingDB
Found 1 hit for monomerid = 50406196
Trg + Lig
Ki
nM
ΔG°
kcal/mole
IC50
nM
Kd
nM
EC50/IC50
nM
koff
s-1
kon
M-1s-1
pHTemp
°C
Leukocyte elastase
(Homo sapiens (Human))
BDBM50406196
(CHEMBL335798)
Show SMILES CC(C)N(C(C)C)c1nc2cccc(C)c2c(=O)o1
Show InChI InChI=1S/C15H20N2O2/c1-9(2)17(10(3)4)15-16-12-8-6-7-11(5)13(12)14(18)19-15/h6-10H,1-5H3
Reactome pathway
398n/an/an/an/a 0.0000389 97.7n/an/a
Syntex Research
Curated by ChEMBL
Assay Description
Component deacylation rate constant for interaction with human leukocyte elastase
J Med Chem 33: 464-79 (1990)
Checked by Author
BindingDB Entry DOI: 10.7270/Q2PR7X6X