BDBM50406224 CHEMBL145565
SMILES: Cc1cccc2nc(oc(=O)c12)C(F)(F)F
InChI Key: InChIKey=NMGDXCBZTVNKBJ-UHFFFAOYSA-N
Data: 1 KI  1 Koff  1 Kon
Activity Spreadsheet -- Enzyme Inhibition Constant Data from BindingDB
Found 1 hit for monomerid = 50406224
Trg + Lig
Ki
nM
ΔG°
kcal/mole
IC50
nM
Kd
nM
EC50/IC50
nM
koff
s-1
kon
M-1s-1
pHTemp
°C
Leukocyte elastase
(Homo sapiens (Human))
BDBM50406224
(CHEMBL145565)
Show SMILES Cc1cccc2nc(oc(=O)c12)C(F)(F)F
Show InChI InChI=1S/C10H6F3NO2/c1-5-3-2-4-6-7(5)8(15)16-9(14-6)10(11,12)13/h2-4H,1H3
Reactome pathway
31.6n/an/an/an/a 0.00371 1.29E+5n/an/a
Syntex Research
Curated by ChEMBL
Assay Description
Component deacylation rate constant for interaction with human leukocyte elastase
J Med Chem 33: 464-79 (1990)
Checked by Author
BindingDB Entry DOI: 10.7270/Q2PR7X6X