null
SMILES: CCOc1nc2cccc(\C=C\C)c2c(=O)o1
InChI Key: InChIKey=ZJICXJVSOKTMJJ-ZZXKWVIFSA-N
Activity Spreadsheet -- Enzyme Inhibition Constant Data from BindingDB
Found 1 hit for monomerid = 50406234
Trg + Lig
Ki
nM
ΔG°
kcal/mole
IC50
nM
Kd
nM
EC50/IC50
nM
koff
s-1
kon
M-1s-1
pHTemp
°C
Neutrophil elastase
(Homo sapiens (Human))
BDBM50406234
(CHEMBL145774)
Show SMILES CCOc1nc2cccc(\C=C\C)c2c(=O)o1
Show InChI InChI=1S/C13H13NO3/c1-3-6-9-7-5-8-10-11(9)12(15)17-13(14-10)16-4-2/h3,5-8H,4H2,1-2H3/b6-3+
Reactome pathway
0.200n/an/an/an/a 0.0000661 3.47E+5n/an/a
Syntex Research
Curated by ChEMBL
Assay Description
Component deacylation rate constant for interaction with human leukocyte elastase
J Med Chem 33: 464-79 (1990)
Checked by Author
BindingDB Entry DOI: 10.7270/Q2PR7X6X