BDBM50406240 CHEMBL347760
SMILES: CCOc1nc2cc(OC)cc(C)c2c(=O)o1
InChI Key: InChIKey=MLKUOZSFOLTJKX-UHFFFAOYSA-N
Data: 1 KI  1 Koff  1 Kon
Activity Spreadsheet -- Enzyme Inhibition Constant Data from BindingDB
Found 1 hit for monomerid = 50406240
Trg + Lig
Ki
nM
ΔG°
kcal/mole
IC50
nM
Kd
nM
EC50/IC50
nM
koff
s-1
kon
M-1s-1
pHTemp
°C
Neutrophil elastase
(Homo sapiens (Human))
BDBM50406240
(CHEMBL347760)
Show SMILES CCOc1nc2cc(OC)cc(C)c2c(=O)o1
Show InChI InChI=1S/C12H13NO4/c1-4-16-12-13-9-6-8(15-3)5-7(2)10(9)11(14)17-12/h5-6H,4H2,1-3H3
Reactome pathway
0.398n/an/an/an/a 0.0000182 4.57E+4n/an/a
Syntex Research
Curated by ChEMBL
Assay Description
Component deacylation rate constant for interaction with human leukocyte elastase
J Med Chem 33: 464-79 (1990)
Checked by Author
BindingDB Entry DOI: 10.7270/Q2PR7X6X