BDBM50406480 CHEMBL276476
SMILES: Cn1n(Cc2ccccc2)c(=O)c2ccccc12
InChI Key: InChIKey=HBWGTSIDRXRGNT-UHFFFAOYSA-N
Data: 1 IC50  1 EC50
Activity Spreadsheet -- Enzyme Inhibition Constant Data from BindingDB
Found 2 hits for monomerid = 50406480
Trg + Lig
Ki
nM
ΔG°
kcal/mole
IC50
nM
Kd
nM
EC50/IC50
nM
koff
s-1
kon
M-1s-1
pHTemp
°C
Arachidonate 5-lipoxygenase
(Homo sapiens (Human))
BDBM50406480
(CHEMBL276476)
Show SMILES Cn1n(Cc2ccccc2)c(=O)c2ccccc12
Show InChI InChI=1S/C15H14N2O/c1-16-14-10-6-5-9-13(14)15(18)17(16)11-12-7-3-2-4-8-12/h2-10H,11H2,1H3
Reactome pathway
n/an/an/an/a>100n/an/an/an/a
ICI Pharma
Curated by ChEMBL
Assay Description
Ex vivo inhibition of LTB4 production was measured in dog blood
J Med Chem 34: 1028-36 (1991)
BindingDB Entry DOI: 10.7270/Q28G8MXH
Arachidonate 5-lipoxygenase
(Rattus norvegicus)
BDBM50406480
(CHEMBL276476)
Show SMILES Cn1n(Cc2ccccc2)c(=O)c2ccccc12
Show InChI InChI=1S/C15H14N2O/c1-16-14-10-6-5-9-13(14)15(18)17(16)11-12-7-3-2-4-8-12/h2-10H,11H2,1H3
n/an/a>3.00E+4n/an/an/an/an/an/a
ICI Pharma
Curated by ChEMBL
Assay Description
In vitro inhibition of LTB4 production was measured in rat blood
J Med Chem 34: 1028-36 (1991)
BindingDB Entry DOI: 10.7270/Q28G8MXH