BDBM50406502 CHEMBL604212
SMILES: Nc1nc(OCCCCCc2ccccc2)nc2n(cnc12)C1O[C@@H](CO)[C@H](O)[C@@H]1O
InChI Key: InChIKey=SJMVCDOAQMYAKZ-YQASGENESA-N
Data: 2 EC50
Activity Spreadsheet -- Enzyme Inhibition Constant Data from BindingDB
Found 2 hits for monomerid = 50406502
Trg + Lig
Ki
nM
ΔG°
kcal/mole
IC50
nM
Kd
nM
EC50/IC50
nM
koff
s-1
kon
M-1s-1
pHTemp
°C
Adenosine A2 receptor
(Homo sapiens (Human))
BDBM50406502
(CHEMBL604212)
Show SMILES Nc1nc(OCCCCCc2ccccc2)nc2n(cnc12)C1O[C@@H](CO)[C@H](O)[C@@H]1O |r|
Show InChI InChI=1S/C21H27N5O5/c22-18-15-19(26(12-23-15)20-17(29)16(28)14(11-27)31-20)25-21(24-18)30-10-6-2-5-9-13-7-3-1-4-8-13/h1,3-4,7-8,12,14,16-17,20,27-29H,2,5-6,9-11H2,(H2,22,24,25)/t14-,16-,17-,20?/m0/s1
n/an/an/an/a 6.30n/an/an/an/a
University of South Florida
Curated by ChEMBL
Assay Description
Concentration required for coronary arteries vasodilation at the A2 adenosine receptor in langendorff guinea pig heart preparation
J Med Chem 34: 1340-4 (1991)
BindingDB Entry DOI: 10.7270/Q24T6KJM
Adenosine A1 receptor
(GUINEA PIG)
BDBM50406502
(CHEMBL604212)
Show SMILES Nc1nc(OCCCCCc2ccccc2)nc2n(cnc12)C1O[C@@H](CO)[C@H](O)[C@@H]1O |r|
Show InChI InChI=1S/C21H27N5O5/c22-18-15-19(26(12-23-15)20-17(29)16(28)14(11-27)31-20)25-21(24-18)30-10-6-2-5-9-13-7-3-1-4-8-13/h1,3-4,7-8,12,14,16-17,20,27-29H,2,5-6,9-11H2,(H2,22,24,25)/t14-,16-,17-,20?/m0/s1
n/an/an/an/a 4.57E+3n/an/an/an/a
University of South Florida
Curated by ChEMBL
Assay Description
Effective concentration required for prolongation of the stimulus-QRS interval by 50% of the maximum response at the A1 adenosine receptor in langend...
J Med Chem 34: 1340-4 (1991)
BindingDB Entry DOI: 10.7270/Q24T6KJM