BDBM50406503 CHEMBL606081
SMILES: Nc1nc(OCCc2cccc(F)c2)nc2n(cnc12)C1O[C@@H](CO)[C@H](O)[C@@H]1O
InChI Key: InChIKey=VJSICGUJMFZSKL-JVCSGSNQSA-N
Data: 2 EC50
Activity Spreadsheet -- Enzyme Inhibition Constant Data from BindingDB
Found 2 hits for monomerid = 50406503
Trg + Lig
Ki
nM
ΔG°
kcal/mole
IC50
nM
Kd
nM
EC50/IC50
nM
koff
s-1
kon
M-1s-1
pHTemp
°C
Adenosine A2 receptor
(Homo sapiens (Human))
BDBM50406503
(CHEMBL606081)
Show SMILES Nc1nc(OCCc2cccc(F)c2)nc2n(cnc12)C1O[C@@H](CO)[C@H](O)[C@@H]1O |r|
Show InChI InChI=1S/C18H20FN5O5/c19-10-3-1-2-9(6-10)4-5-28-18-22-15(20)12-16(23-18)24(8-21-12)17-14(27)13(26)11(7-25)29-17/h1-3,6,8,11,13-14,17,25-27H,4-5,7H2,(H2,20,22,23)/t11-,13-,14-,17?/m0/s1
n/an/an/an/a 1.90n/an/an/an/a
University of South Florida
Curated by ChEMBL
Assay Description
Concentration required for coronary arteries vasodilation at the A2 adenosine receptor in langendorff guinea pig heart preparation
J Med Chem 34: 1340-4 (1991)
BindingDB Entry DOI: 10.7270/Q24T6KJM
Adenosine A1 receptor
(GUINEA PIG)
BDBM50406503
(CHEMBL606081)
Show SMILES Nc1nc(OCCc2cccc(F)c2)nc2n(cnc12)C1O[C@@H](CO)[C@H](O)[C@@H]1O |r|
Show InChI InChI=1S/C18H20FN5O5/c19-10-3-1-2-9(6-10)4-5-28-18-22-15(20)12-16(23-18)24(8-21-12)17-14(27)13(26)11(7-25)29-17/h1-3,6,8,11,13-14,17,25-27H,4-5,7H2,(H2,20,22,23)/t11-,13-,14-,17?/m0/s1
n/an/an/an/a 3.47E+4n/an/an/an/a
University of South Florida
Curated by ChEMBL
Assay Description
Effective concentration required for prolongation of the stimulus-QRS interval by 50% of the maximum response at the A1 adenosine receptor in langend...
J Med Chem 34: 1340-4 (1991)
BindingDB Entry DOI: 10.7270/Q24T6KJM