BDBM50406518 CHEMBL604422
SMILES: COc1cccc(CCOc2nc(N)c3ncn(C4O[C@@H](CO)[C@H](O)[C@@H]4O)c3n2)c1
InChI Key: InChIKey=YCDNJIDZVJCANU-QAYVNIIMSA-N
Data: 2 EC50
Activity Spreadsheet -- Enzyme Inhibition Constant Data from BindingDB
Found 2 hits for monomerid = 50406518
Trg + Lig
Ki
nM
ΔG°
kcal/mole
IC50
nM
Kd
nM
EC50/IC50
nM
koff
s-1
kon
M-1s-1
pHTemp
°C
Adenosine A2 receptor
(Homo sapiens (Human))
BDBM50406518
(CHEMBL604422)
Show SMILES COc1cccc(CCOc2nc(N)c3ncn(C4O[C@@H](CO)[C@H](O)[C@@H]4O)c3n2)c1 |r|
Show InChI InChI=1S/C19H23N5O6/c1-28-11-4-2-3-10(7-11)5-6-29-19-22-16(20)13-17(23-19)24(9-21-13)18-15(27)14(26)12(8-25)30-18/h2-4,7,9,12,14-15,18,25-27H,5-6,8H2,1H3,(H2,20,22,23)/t12-,14-,15-,18?/m0/s1
n/an/an/an/a 2.60n/an/an/an/a
University of South Florida
Curated by ChEMBL
Assay Description
Concentration required for coronary arteries vasodilation at the Adenosine A2 receptor in langendorff guinea pig heart preparation
J Med Chem 34: 1340-4 (1991)
BindingDB Entry DOI: 10.7270/Q24T6KJM
Adenosine A1 receptor
(GUINEA PIG)
BDBM50406518
(CHEMBL604422)
Show SMILES COc1cccc(CCOc2nc(N)c3ncn(C4O[C@@H](CO)[C@H](O)[C@@H]4O)c3n2)c1 |r|
Show InChI InChI=1S/C19H23N5O6/c1-28-11-4-2-3-10(7-11)5-6-29-19-22-16(20)13-17(23-19)24(9-21-13)18-15(27)14(26)12(8-25)30-18/h2-4,7,9,12,14-15,18,25-27H,5-6,8H2,1H3,(H2,20,22,23)/t12-,14-,15-,18?/m0/s1
n/an/an/an/a 1.62E+4n/an/an/an/a
University of South Florida
Curated by ChEMBL
Assay Description
Effective concentration required for prolongation of the stimulus-QRS interval by 50% of the maximum response at the Adenosine A1 receptor in langend...
J Med Chem 34: 1340-4 (1991)
BindingDB Entry DOI: 10.7270/Q24T6KJM