BDBM50406521 CHEMBL605461
SMILES: Nc1nc(OCCc2ccsc2)nc2n(cnc12)C1O[C@@H](CO)[C@H](O)[C@@H]1O
InChI Key: InChIKey=OISMCBJDQAPTCF-PHOHYCPASA-N
Data: 2 EC50
Activity Spreadsheet -- Enzyme Inhibition Constant Data from BindingDB
Found 2 hits for monomerid = 50406521
Trg + Lig
Ki
nM
ΔG°
kcal/mole
IC50
nM
Kd
nM
EC50/IC50
nM
koff
s-1
kon
M-1s-1
pHTemp
°C
Adenosine A2 receptor
(Homo sapiens (Human))
BDBM50406521
(CHEMBL605461)
Show SMILES Nc1nc(OCCc2ccsc2)nc2n(cnc12)C1O[C@@H](CO)[C@H](O)[C@@H]1O |r|
Show InChI InChI=1S/C16H19N5O5S/c17-13-10-14(20-16(19-13)25-3-1-8-2-4-27-6-8)21(7-18-10)15-12(24)11(23)9(5-22)26-15/h2,4,6-7,9,11-12,15,22-24H,1,3,5H2,(H2,17,19,20)/t9-,11-,12-,15?/m0/s1
n/an/an/an/a 3.40n/an/an/an/a
University of South Florida
Curated by ChEMBL
Assay Description
Concentration required for coronary arteries vasodilation at the Adenosine A2 receptor in langendorff guinea pig heart preparation
J Med Chem 34: 1340-4 (1991)
BindingDB Entry DOI: 10.7270/Q24T6KJM
Adenosine A1 receptor
(GUINEA PIG)
BDBM50406521
(CHEMBL605461)
Show SMILES Nc1nc(OCCc2ccsc2)nc2n(cnc12)C1O[C@@H](CO)[C@H](O)[C@@H]1O |r|
Show InChI InChI=1S/C16H19N5O5S/c17-13-10-14(20-16(19-13)25-3-1-8-2-4-27-6-8)21(7-18-10)15-12(24)11(23)9(5-22)26-15/h2,4,6-7,9,11-12,15,22-24H,1,3,5H2,(H2,17,19,20)/t9-,11-,12-,15?/m0/s1
n/an/an/an/a 1.86E+4n/an/an/an/a
University of South Florida
Curated by ChEMBL
Assay Description
Effective concentration required for prolongation of the stimulus-QRS interval by 50% of the maximum response at the Adenosine A1 receptor in langend...
J Med Chem 34: 1340-4 (1991)
BindingDB Entry DOI: 10.7270/Q24T6KJM