BDBM50406529 CHEMBL51540
SMILES: CCC(C)NC=Nc1ccc(cc1)-c1c[nH]cn1
InChI Key: InChIKey=SKJJLZMUIPRNCX-UHFFFAOYSA-N
Data: 1 Kd
Activity Spreadsheet -- Enzyme Inhibition Constant Data from BindingDB
Found 1 hit for monomerid = 50406529
Trg + Lig
Ki
nM
ΔG°
kcal/mole
IC50
nM
Kd
nM
EC50/IC50
nM
koff
s-1
kon
M-1s-1
pHTemp
°C
Histamine H2 receptor
(Cavia porcellus (domestic guinea pig))
BDBM50406529
(CHEMBL51540)
Show SMILES CCC(C)NC=Nc1ccc(cc1)-c1c[nH]cn1 |w:5.4|
Show InChI InChI=1S/C14H18N4/c1-3-11(2)16-10-17-13-6-4-12(5-7-13)14-8-15-9-18-14/h4-11H,3H2,1-2H3,(H,15,18)(H,16,17)
n/an/an/a 14.1n/an/an/an/an/a
Research Laboratories of Istituto De Angeli
Curated by ChEMBL
Assay Description
Histamine H2 receptor antagonism on the right atrium of the guinea pig
J Med Chem 34: 1772-6 (1991)
BindingDB Entry DOI: 10.7270/Q2W95BCR