BDBM50406651 CHEMBL316154
SMILES: COc1ccccc1NC(=O)NCCCOc1cccc(CN2CCCCC2)c1
InChI Key: InChIKey=OBUBIWBERRXLMA-UHFFFAOYSA-N
Data: 1 Kd
Activity Spreadsheet -- Enzyme Inhibition Constant Data from BindingDB
Found 1 hit for monomerid = 50406651
Trg + Lig
Ki
nM
ΔG°
kcal/mole
IC50
nM
Kd
nM
EC50/IC50
nM
koff
s-1
kon
M-1s-1
pHTemp
°C
Histamine H2 receptor
(Cavia porcellus (domestic guinea pig))
BDBM50406651
(CHEMBL316154)
Show SMILES COc1ccccc1NC(=O)NCCCOc1cccc(CN2CCCCC2)c1
Show InChI InChI=1S/C23H31N3O3/c1-28-22-12-4-3-11-21(22)25-23(27)24-13-8-16-29-20-10-7-9-19(17-20)18-26-14-5-2-6-15-26/h3-4,7,9-12,17H,2,5-6,8,13-16,18H2,1H3,(H2,24,25,27)
n/an/an/a 776n/an/an/an/an/a
Kyorin Pharmaceutical Company, Ltd.
Curated by ChEMBL
Assay Description
In vitro inhibitory activity against histamine H2-receptor in isolated Guinea pig right atria.
J Med Chem 35: 2446-51 (1992)
BindingDB Entry DOI: 10.7270/Q2V9898T