BDBM50406659 CHEMBL78339
SMILES: FCCNC(=O)NCCCOc1cccc(CN2CCCCC2)c1
InChI Key: InChIKey=BNFNSTGIBNGTGC-UHFFFAOYSA-N
Data: 1 Kd
Activity Spreadsheet -- Enzyme Inhibition Constant Data from BindingDB
Found 1 hit for monomerid = 50406659
Trg + Lig
Ki
nM
ΔG°
kcal/mole
IC50
nM
Kd
nM
EC50/IC50
nM
koff
s-1
kon
M-1s-1
pHTemp
°C
Histamine H2 receptor
(Cavia porcellus (domestic guinea pig))
BDBM50406659
(CHEMBL78339)
Show SMILES FCCNC(=O)NCCCOc1cccc(CN2CCCCC2)c1
Show InChI InChI=1S/C18H28FN3O2/c19-8-10-21-18(23)20-9-5-13-24-17-7-4-6-16(14-17)15-22-11-2-1-3-12-22/h4,6-7,14H,1-3,5,8-13,15H2,(H2,20,21,23)
n/an/an/a 85.1n/an/an/an/an/a
Kyorin Pharmaceutical Company, Ltd.
Curated by ChEMBL
Assay Description
In vitro inhibitory activity against histamine H2-receptor in isolated Guinea pig right atria.
J Med Chem 35: 2446-51 (1992)
BindingDB Entry DOI: 10.7270/Q2V9898T