BDBM50406670 DALCOTIDINE
SMILES: CCNC(=O)NCCCOc1cccc(CN2CCCCC2)c1
InChI Key: InChIKey=SVCQBXMFONNZHX-UHFFFAOYSA-N
Data: 1 Kd
Activity Spreadsheet -- Enzyme Inhibition Constant Data from BindingDB
Found 1 hit for monomerid = 50406670
Trg + Lig
Ki
nM
ΔG°
kcal/mole
IC50
nM
Kd
nM
EC50/IC50
nM
koff
s-1
kon
M-1s-1
pHTemp
°C
Histamine H2 receptor
(Cavia porcellus (domestic guinea pig))
BDBM50406670
(DALCOTIDINE)
Show SMILES CCNC(=O)NCCCOc1cccc(CN2CCCCC2)c1
Show InChI InChI=1S/C18H29N3O2/c1-2-19-18(22)20-10-7-13-23-17-9-6-8-16(14-17)15-21-11-4-3-5-12-21/h6,8-9,14H,2-5,7,10-13,15H2,1H3,(H2,19,20,22)
n/an/an/a 40.7n/an/an/an/an/a
Kyorin Pharmaceutical Company, Ltd.
Curated by ChEMBL
Assay Description
In vitro inhibitory activity against histamine H2-receptor in isolated Guinea pig right atria.
J Med Chem 35: 2446-51 (1992)
BindingDB Entry DOI: 10.7270/Q2V9898T