BDBM50406672 CHEMBL309659
SMILES: Clc1cccc(NC(=O)NCCCOc2cccc(CN3CCCCC3)c2)c1
InChI Key: InChIKey=UTIMORNHEWNENA-UHFFFAOYSA-N
Data: 1 Kd
Activity Spreadsheet -- Enzyme Inhibition Constant Data from BindingDB
Found 1 hit for monomerid = 50406672
Trg + Lig
Ki
nM
ΔG°
kcal/mole
IC50
nM
Kd
nM
EC50/IC50
nM
koff
s-1
kon
M-1s-1
pHTemp
°C
Histamine H2 receptor
(Cavia porcellus (domestic guinea pig))
BDBM50406672
(CHEMBL309659)
Show SMILES Clc1cccc(NC(=O)NCCCOc2cccc(CN3CCCCC3)c2)c1
Show InChI InChI=1S/C22H28ClN3O2/c23-19-8-5-9-20(16-19)25-22(27)24-11-6-14-28-21-10-4-7-18(15-21)17-26-12-2-1-3-13-26/h4-5,7-10,15-16H,1-3,6,11-14,17H2,(H2,24,25,27)
n/an/an/a 316n/an/an/an/an/a
Kyorin Pharmaceutical Company, Ltd.
Curated by ChEMBL
Assay Description
In vitro inhibitory activity against histamine H2-receptor in isolated Guinea pig right atria.
J Med Chem 35: 2446-51 (1992)
BindingDB Entry DOI: 10.7270/Q2V9898T