BDBM50406759 CHEMBL39331
SMILES: COc1ccc(Cc2noc(n2)-c2ccc3[nH]cc(CCN)c3c2)cc1
InChI Key: InChIKey=MLCUFIVGGFREKB-UHFFFAOYSA-N
Data: 5 IC50
Activity Spreadsheet -- Enzyme Inhibition Constant Data from BindingDB
Found 5 hits for monomerid = 50406759
Trg + Lig
Ki
nM
ΔG°
kcal/mole
IC50
nM
Kd
nM
EC50/IC50
nM
koff
s-1
kon
M-1s-1
pHTemp
°C
Serotonin 1d (5-HT1d) receptor
(Sus scrofa)
BDBM50406759
(CHEMBL39331)
Show SMILES COc1ccc(Cc2noc(n2)-c2ccc3[nH]cc(CCN)c3c2)cc1
Show InChI InChI=1S/C20H20N4O2/c1-25-16-5-2-13(3-6-16)10-19-23-20(26-24-19)14-4-7-18-17(11-14)15(8-9-21)12-22-18/h2-7,11-12,22H,8-10,21H2,1H3
n/an/a 0.794n/an/an/an/an/an/a
Merck Sharp and Dohme Research Laboratories
Curated by ChEMBL
Assay Description
Displacement of radioligand [3H]5-HT binding to 5-hydroxytryptamine 1D receptor in pig caudate membrane
J Med Chem 36: 1529-38 (1993)
BindingDB Entry DOI: 10.7270/Q22V2HB9
5-hydroxytryptamine receptor 2C
(Homo sapiens (Human))
BDBM50406759
(CHEMBL39331)
Show SMILES COc1ccc(Cc2noc(n2)-c2ccc3[nH]cc(CCN)c3c2)cc1
Show InChI InChI=1S/C20H20N4O2/c1-25-16-5-2-13(3-6-16)10-19-23-20(26-24-19)14-4-7-18-17(11-14)15(8-9-21)12-22-18/h2-7,11-12,22H,8-10,21H2,1H3
Reactome pathway
n/an/a 794n/an/an/an/an/an/a
Merck Sharp and Dohme Research Laboratories
Curated by ChEMBL
Assay Description
Displacement of [3H]mesulergine from pig cortex 5-hydroxytryptamine 1C receptor
J Med Chem 36: 1529-38 (1993)
BindingDB Entry DOI: 10.7270/Q22V2HB9
Serotonin 2 (5-HT2) receptor
(Rattus norvegicus (rat)-RAT-Rattus norvegicus (Rat...)
BDBM50406759
(CHEMBL39331)
Show SMILES COc1ccc(Cc2noc(n2)-c2ccc3[nH]cc(CCN)c3c2)cc1
Show InChI InChI=1S/C20H20N4O2/c1-25-16-5-2-13(3-6-16)10-19-23-20(26-24-19)14-4-7-18-17(11-14)15(8-9-21)12-22-18/h2-7,11-12,22H,8-10,21H2,1H3
n/an/a 1.00E+3n/an/an/an/an/an/a
Merck Sharp and Dohme Research Laboratories
Curated by ChEMBL
Assay Description
isplacement of [3H]DOB from rat cortex homogenate 5-hydroxytryptamine 2 receptor
J Med Chem 36: 1529-38 (1993)
BindingDB Entry DOI: 10.7270/Q22V2HB9
Serotonin 3a (5-HT3a)/3b (5-HT3b) receptor
(Rattus norvegicus-RAT)
BDBM50406759
(CHEMBL39331)
Show SMILES COc1ccc(Cc2noc(n2)-c2ccc3[nH]cc(CCN)c3c2)cc1
Show InChI InChI=1S/C20H20N4O2/c1-25-16-5-2-13(3-6-16)10-19-23-20(26-24-19)14-4-7-18-17(11-14)15(8-9-21)12-22-18/h2-7,11-12,22H,8-10,21H2,1H3
n/an/a<1.00E+4n/an/an/an/an/an/a
Merck Sharp and Dohme Research Laboratories
Curated by ChEMBL
Assay Description
Displacement of [3H]-Q-ICS 205-930 from rat cortex homogenate 5-hydroxytryptamine 3 receptor
J Med Chem 36: 1529-38 (1993)
BindingDB Entry DOI: 10.7270/Q22V2HB9
5-hydroxytryptamine receptor 1A
(Homo sapiens (Human))
BDBM50406759
(CHEMBL39331)
Show SMILES COc1ccc(Cc2noc(n2)-c2ccc3[nH]cc(CCN)c3c2)cc1
Show InChI InChI=1S/C20H20N4O2/c1-25-16-5-2-13(3-6-16)10-19-23-20(26-24-19)14-4-7-18-17(11-14)15(8-9-21)12-22-18/h2-7,11-12,22H,8-10,21H2,1H3
n/an/a 5n/an/an/an/an/an/a
Merck Sharp and Dohme Research Laboratories
Curated by ChEMBL
Assay Description
Displacement of [3H]8-OH-DPAT from pig cortex 5-hydroxytryptamine 1A receptor
J Med Chem 36: 1529-38 (1993)
BindingDB Entry DOI: 10.7270/Q22V2HB9