BDBM50406762 CHEMBL37462
SMILES: CN(C)CCc1c[nH]c2ccc(Cc3nc(N)ns3)cc12
InChI Key: InChIKey=BEDGPDAVDXHRMR-UHFFFAOYSA-N
Data: 6 IC50
Activity Spreadsheet -- Enzyme Inhibition Constant Data from BindingDB
Found 6 hits for monomerid = 50406762
Trg + Lig
Ki
nM
ΔG°
kcal/mole
IC50
nM
Kd
nM
EC50/IC50
nM
koff
s-1
kon
M-1s-1
pHTemp
°C
Serotonin 1d (5-HT1d) receptor
(Sus scrofa)
BDBM50406762
(CHEMBL37462)
Show SMILES CN(C)CCc1c[nH]c2ccc(Cc3nc(N)ns3)cc12
Show InChI InChI=1S/C15H19N5S/c1-20(2)6-5-11-9-17-13-4-3-10(7-12(11)13)8-14-18-15(16)19-21-14/h3-4,7,9,17H,5-6,8H2,1-2H3,(H2,16,19)
n/an/a 2n/an/an/an/an/an/a
TBA
Curated by ChEMBL
Assay Description
Compound was tested for the displacement of [3H]-5-HT to 5-hydroxytryptamine 1D receptor recognition sites in pig caudate membranes
Bioorg Med Chem Lett 3: 993-997 (1993)
Article DOI: 10.1016/S0960-894X(00)80274-7
BindingDB Entry DOI: 10.7270/Q2Z89DQV
Serotonin 1d (5-HT1d) receptor
(Sus scrofa)
BDBM50406762
(CHEMBL37462)
Show SMILES CN(C)CCc1c[nH]c2ccc(Cc3nc(N)ns3)cc12
Show InChI InChI=1S/C15H19N5S/c1-20(2)6-5-11-9-17-13-4-3-10(7-12(11)13)8-14-18-15(16)19-21-14/h3-4,7,9,17H,5-6,8H2,1-2H3,(H2,16,19)
n/an/a 2n/an/an/an/an/an/a
Merck Sharp and Dohme Research Laboratories
Curated by ChEMBL
Assay Description
Displacement of radioligand [3H]5-HT binding to 5-hydroxytryptamine 1D receptor in pig caudate membrane
J Med Chem 36: 1529-38 (1993)
BindingDB Entry DOI: 10.7270/Q22V2HB9
Serotonin 3a (5-HT3a)/3b (5-HT3b) receptor
(Rattus norvegicus-RAT)
BDBM50406762
(CHEMBL37462)
Show SMILES CN(C)CCc1c[nH]c2ccc(Cc3nc(N)ns3)cc12
Show InChI InChI=1S/C15H19N5S/c1-20(2)6-5-11-9-17-13-4-3-10(7-12(11)13)8-14-18-15(16)19-21-14/h3-4,7,9,17H,5-6,8H2,1-2H3,(H2,16,19)
n/an/a 2.40E+3n/an/an/an/an/an/a
Merck Sharp and Dohme Research Laboratories
Curated by ChEMBL
Assay Description
Displacement of [3H]-Q-ICS 205-930 from rat cortex homogenate 5-hydroxytryptamine 3 receptor
J Med Chem 36: 1529-38 (1993)
BindingDB Entry DOI: 10.7270/Q22V2HB9
5-hydroxytryptamine receptor 2C
(Homo sapiens (Human))
BDBM50406762
(CHEMBL37462)
Show SMILES CN(C)CCc1c[nH]c2ccc(Cc3nc(N)ns3)cc12
Show InChI InChI=1S/C15H19N5S/c1-20(2)6-5-11-9-17-13-4-3-10(7-12(11)13)8-14-18-15(16)19-21-14/h3-4,7,9,17H,5-6,8H2,1-2H3,(H2,16,19)
Reactome pathway
n/an/a 251n/an/an/an/an/an/a
Merck Sharp and Dohme Research Laboratories
Curated by ChEMBL
Assay Description
Displacement of [3H]mesulergine from pig cortex 5-hydroxytryptamine 1C receptor
J Med Chem 36: 1529-38 (1993)
BindingDB Entry DOI: 10.7270/Q22V2HB9
Serotonin 2 (5-HT2) receptor
(Rattus norvegicus (rat)-RAT-Rattus norvegicus (Rat...)
BDBM50406762
(CHEMBL37462)
Show SMILES CN(C)CCc1c[nH]c2ccc(Cc3nc(N)ns3)cc12
Show InChI InChI=1S/C15H19N5S/c1-20(2)6-5-11-9-17-13-4-3-10(7-12(11)13)8-14-18-15(16)19-21-14/h3-4,7,9,17H,5-6,8H2,1-2H3,(H2,16,19)
n/an/a 126n/an/an/an/an/an/a
Merck Sharp and Dohme Research Laboratories
Curated by ChEMBL
Assay Description
isplacement of [3H]DOB from rat cortex homogenate 5-hydroxytryptamine 2 receptor
J Med Chem 36: 1529-38 (1993)
BindingDB Entry DOI: 10.7270/Q22V2HB9
5-hydroxytryptamine receptor 1A
(Homo sapiens (Human))
BDBM50406762
(CHEMBL37462)
Show SMILES CN(C)CCc1c[nH]c2ccc(Cc3nc(N)ns3)cc12
Show InChI InChI=1S/C15H19N5S/c1-20(2)6-5-11-9-17-13-4-3-10(7-12(11)13)8-14-18-15(16)19-21-14/h3-4,7,9,17H,5-6,8H2,1-2H3,(H2,16,19)
n/an/a 50n/an/an/an/an/an/a
Merck Sharp and Dohme Research Laboratories
Curated by ChEMBL
Assay Description
Displacement of [3H]8-OH-DPAT from pig cortex 5-hydroxytryptamine 1A receptor
J Med Chem 36: 1529-38 (1993)
BindingDB Entry DOI: 10.7270/Q22V2HB9