BDBM50406785 CHEMBL39435
SMILES: CNS(=O)(=O)c1ccc(Cc2noc(n2)-c2ccc3[nH]cc(CCN)c3c2)cc1
InChI Key: InChIKey=RYTUHJYSYWUTTQ-UHFFFAOYSA-N
Data: 1 IC50
Activity Spreadsheet -- Enzyme Inhibition Constant Data from BindingDB
Found 1 hit for monomerid = 50406785
Trg + Lig
Ki
nM
ΔG°
kcal/mole
IC50
nM
Kd
nM
EC50/IC50
nM
koff
s-1
kon
M-1s-1
pHTemp
°C
Serotonin 1d (5-HT1d) receptor
(Sus scrofa)
BDBM50406785
(CHEMBL39435)
Show SMILES CNS(=O)(=O)c1ccc(Cc2noc(n2)-c2ccc3[nH]cc(CCN)c3c2)cc1
Show InChI InChI=1S/C20H21N5O3S/c1-22-29(26,27)16-5-2-13(3-6-16)10-19-24-20(28-25-19)14-4-7-18-17(11-14)15(8-9-21)12-23-18/h2-7,11-12,22-23H,8-10,21H2,1H3
n/an/a 0.251n/an/an/an/an/an/a
Merck Sharp and Dohme Research Laboratories
Curated by ChEMBL
Assay Description
Displacement of radioligand [3H]5-HT binding to 5-hydroxytryptamine 1D receptor in pig caudate membrane
J Med Chem 36: 1529-38 (1993)
BindingDB Entry DOI: 10.7270/Q22V2HB9