BDBM50406786 CHEMBL40126
SMILES: COc1cccc(Cc2noc(n2)-c2ccc3[nH]cc(CCN)c3c2)c1
InChI Key: InChIKey=XYSVDZDGDYOEQP-UHFFFAOYSA-N
Data: 1 IC50
Activity Spreadsheet -- Enzyme Inhibition Constant Data from BindingDB
Found 1 hit for monomerid = 50406786
Trg + Lig
Ki
nM
ΔG°
kcal/mole
IC50
nM
Kd
nM
EC50/IC50
nM
koff
s-1
kon
M-1s-1
pHTemp
°C
Serotonin 1d (5-HT1d) receptor
(Sus scrofa)
BDBM50406786
(CHEMBL40126)
Show SMILES COc1cccc(Cc2noc(n2)-c2ccc3[nH]cc(CCN)c3c2)c1
Show InChI InChI=1S/C20H20N4O2/c1-25-16-4-2-3-13(9-16)10-19-23-20(26-24-19)14-5-6-18-17(11-14)15(7-8-21)12-22-18/h2-6,9,11-12,22H,7-8,10,21H2,1H3
n/an/a 1.30n/an/an/an/an/an/a
Merck Sharp and Dohme Research Laboratories
Curated by ChEMBL
Assay Description
Displacement of radioligand [3H]5-HT binding to 5-hydroxytryptamine 1D receptor in pig caudate membrane
J Med Chem 36: 1529-38 (1993)
BindingDB Entry DOI: 10.7270/Q22V2HB9