null
SMILES: CC[C@@]1(O)C(=O)OCc2c1cc1-c3nc4cc5OCOc5c([N+]([O-])=O)c4cc3Cn1c2=O
InChI Key: InChIKey=DMUCLZLYDBNSRL-NRFANRHFSA-N
Activity Spreadsheet -- Enzyme Inhibition Constant Data from BindingDB
Found 1 hit for monomerid = 50406997
Trg + Lig
Ki
nM
ΔG°
kcal/mole
IC50
nM
Kd
nM
EC50/IC50
nM
koff
s-1
kon
M-1s-1
pHTemp
°C
DNA topoisomerase 1
(Homo sapiens (Human))
BDBM50406997
(CHEMBL2114245)
Show SMILES CC[C@@]1(O)C(=O)OCc2c1cc1-c3nc4cc5OCOc5c([N+]([O-])=O)c4cc3Cn1c2=O |r|
Show InChI InChI=1S/C21H15N3O8/c1-2-21(27)12-4-14-16-9(6-23(14)19(25)11(12)7-30-20(21)26)3-10-13(22-16)5-15-18(32-8-31-15)17(10)24(28)29/h3-5,27H,2,6-8H2,1H3/t21-/m0/s1
n/an/a 150n/an/an/an/an/an/a
Research Triangle Institute
Curated by ChEMBL
Assay Description
Inhibition of Topoisomerase I by cleavage complex formation in human HL-60 cells
J Med Chem 36: 2689-700 (1993)
BindingDB Entry DOI: 10.7270/Q2KP82RH