null
SMILES: CC[C@@]1(O)C(=O)OCc2c1cc1-c3nc4cccc(Cl)c4cc3Cn1c2=O
InChI Key: InChIKey=JAIAKOFIBHDLCA-FQEVSTJZSA-N
Activity Spreadsheet -- Enzyme Inhibition Constant Data from BindingDB
Found 1 hit for monomerid = 50407001
Trg + Lig
Ki
nM
ΔG°
kcal/mole
IC50
nM
Kd
nM
EC50/IC50
nM
koff
s-1
kon
M-1s-1
pHTemp
°C
DNA topoisomerase 1
(Homo sapiens (Human))
BDBM50407001
(CHEMBL2114244)
Show SMILES CC[C@@]1(O)C(=O)OCc2c1cc1-c3nc4cccc(Cl)c4cc3Cn1c2=O |r|
Show InChI InChI=1S/C20H15ClN2O4/c1-2-20(26)13-7-16-17-10(6-11-14(21)4-3-5-15(11)22-17)8-23(16)18(24)12(13)9-27-19(20)25/h3-7,26H,2,8-9H2,1H3/t20-/m0/s1
n/an/a 86n/an/an/an/an/an/a
Research Triangle Institute
Curated by ChEMBL
Assay Description
Inhibition of Topoisomerase I by cleavage complex formation in human HL-60 cells
J Med Chem 36: 2689-700 (1993)
BindingDB Entry DOI: 10.7270/Q2KP82RH