BDBM50407136 CHEMBL176463
SMILES: CCc1cc(CCC2=NC3CCCCC3O2)c(=O)[nH]c1C
InChI Key: InChIKey=IAXQRZNSWJVLEQ-UHFFFAOYSA-N
Data: 1 IC50
Activity Spreadsheet -- Enzyme Inhibition Constant Data from BindingDB
Found 1 hit for monomerid = 50407136
Trg + Lig
Ki
nM
ΔG°
kcal/mole
IC50
nM
Kd
nM
EC50/IC50
nM
koff
s-1
kon
M-1s-1
pHTemp
°C
Human immunodeficiency virus type 1 reverse transcriptase
(Human immunodeficiency virus 1)
BDBM50407136
(CHEMBL176463)
Show SMILES CCc1cc(CCC2=NC3CCCCC3O2)c(=O)[nH]c1C |t:7|
Show InChI InChI=1S/C17H24N2O2/c1-3-12-10-13(17(20)18-11(12)2)8-9-16-19-14-6-4-5-7-15(14)21-16/h10,14-15H,3-9H2,1-2H3,(H,18,20)
n/an/a 58n/an/an/an/an/an/a
Merck Reserch Laboratories
Curated by ChEMBL
Assay Description
Tested for inhibition against HIV-1 RT (used (poly)rC-(oligo)dG as the template)
J Med Chem 36: 953-66 (1993)
BindingDB Entry DOI: 10.7270/Q2JW8G28