null
SMILES: CC1(Cl)C(N=[N+]=[N-])N([C@H]2C[C@H](N=[N+]=[N-])[C@@H](CO)O2)C(=O)NC1=O
InChI Key: InChIKey=WXLBTVDTGAHQTI-KOGJUGEJSA-N
Activity Spreadsheet -- Enzyme Inhibition Constant Data from BindingDB
Found 1 hit for monomerid = 50407260
Trg + Lig
Ki
nM
ΔG°
kcal/mole
IC50
nM
Kd
nM
EC50/IC50
nM
koff
s-1
kon
M-1s-1
pHTemp
°C
Reverse transcriptase/RNaseH
(Human immunodeficiency virus 1)
BDBM50407260
(CHEMBL135203)
Show SMILES CC1(Cl)C(N=[N+]=[N-])N([C@H]2C[C@H](N=[N+]=[N-])[C@@H](CO)O2)C(=O)NC1=O
Show InChI InChI=1S/C10H13ClN8O4/c1-10(11)7(16-18-13)19(9(22)14-8(10)21)6-2-4(15-17-12)5(3-20)23-6/h4-7,20H,2-3H2,1H3,(H,14,21,22)/t4-,5+,6+,7?,10?/m0/s1
n/an/an/an/a 1.49E+3n/an/an/an/a
University of Alberta
Curated by ChEMBL
Assay Description
Effective concentration in vitro agaianst HIV-1-infected CEM cells relative to uninfected untreated controls
J Med Chem 37: 4297-306 (1995)
BindingDB Entry DOI: 10.7270/Q2NP25M9