null
SMILES: CO[C@H]1N([C@H]2C[C@H](N=[N+]=[N-])[C@@H](CO)O2)C(=O)NC(=O)C1(C)Cl
InChI Key: InChIKey=GEKYZSAIEIUJRJ-UTZLRVPFSA-N
Activity Spreadsheet -- Enzyme Inhibition Constant Data from BindingDB
Found 1 hit for monomerid = 50407264
Trg + Lig
Ki
nM
ΔG°
kcal/mole
IC50
nM
Kd
nM
EC50/IC50
nM
koff
s-1
kon
M-1s-1
pHTemp
°C
Reverse transcriptase/RNaseH
(Human immunodeficiency virus 1)
BDBM50407264
(CHEMBL334917)
Show SMILES CO[C@H]1N([C@H]2C[C@H](N=[N+]=[N-])[C@@H](CO)O2)C(=O)NC(=O)C1(C)Cl
Show InChI InChI=1S/C11H16ClN5O5/c1-11(12)8(19)14-10(20)17(9(11)21-2)7-3-5(15-16-13)6(4-18)22-7/h5-7,9,18H,3-4H2,1-2H3,(H,14,19,20)/t5-,6+,7+,9+,11?/m0/s1
n/an/an/an/a 5.79E+3n/an/an/an/a
University of Alberta
Curated by ChEMBL
Assay Description
Effective concentration in vitro agaianst HIV-1-infected CEM cells relative to uninfected untreated controls
J Med Chem 37: 4297-306 (1995)
BindingDB Entry DOI: 10.7270/Q2NP25M9