BDBM50407335 CHEMBL428187
SMILES: CC[C@H](C)[C@H]1NC(=O)[C@H](Cc2cc3ccccc3[nH]2)NC(=O)CC2(CCCCC2)SSC[C@H](NC(=O)[C@@H](CC(N)=O)NC(=O)[C@H](CCC(N)=O)NC1=O)C(=O)N1CCC[C@H]1C(=O)N[C@@H](CCCNC(N)=N)C(=O)NCC(N)=O
InChI Key: InChIKey=HFVDYVQLASNLPU-RBSUJZTISA-N
Data: 4 Kd
Activity Spreadsheet -- Enzyme Inhibition Constant Data from BindingDB
Found 4 hits for monomerid = 50407335
Trg + Lig
Ki
nM
ΔG°
kcal/mole
IC50
nM
Kd
nM
EC50/IC50
nM
koff
s-1
kon
M-1s-1
pHTemp
°C
Oxytocin receptor
(RAT)
BDBM50407335
(CHEMBL428187)
Show SMILES CC[C@H](C)[C@H]1NC(=O)[C@H](Cc2cc3ccccc3[nH]2)NC(=O)CC2(CCCCC2)SSC[C@H](NC(=O)[C@@H](CC(N)=O)NC(=O)[C@H](CCC(N)=O)NC1=O)C(=O)N1CCC[C@H]1C(=O)N[C@@H](CCCNC(N)=N)C(=O)NCC(N)=O
Show InChI InChI=1S/C50H75N15O11S2/c1-3-27(2)41-47(75)61-32(15-16-37(51)66)43(71)62-34(23-38(52)67)44(72)63-35(48(76)65-20-10-14-36(65)46(74)60-31(13-9-19-56-49(54)55)42(70)57-25-39(53)68)26-77-78-50(17-7-4-8-18-50)24-40(69)59-33(45(73)64-41)22-29-21-28-11-5-6-12-30(28)58-29/h5-6,11-12,21,27,31-36,41,58H,3-4,7-10,13-20,22-26H2,1-2H3,(H2,51,66)(H2,52,67)(H2,53,68)(H,57,70)(H,59,69)(H,60,74)(H,61,75)(H,62,71)(H,63,72)(H,64,73)(H4,54,55,56)/t27-,31-,32-,33-,34+,35-,36-,41+/m0/s1
Reactome pathway
n/an/an/a 17n/an/an/an/an/a
Medical College of Ohio
Curated by ChEMBL
Assay Description
In vitro anti-oxytocic activity with out Mg2+.
J Med Chem 38: 1762-9 (1995)
BindingDB Entry DOI: 10.7270/Q24M95QZ
Oxytocin receptor
(RAT)
BDBM50407335
(CHEMBL428187)
Show SMILES CC[C@H](C)[C@H]1NC(=O)[C@H](Cc2cc3ccccc3[nH]2)NC(=O)CC2(CCCCC2)SSC[C@H](NC(=O)[C@@H](CC(N)=O)NC(=O)[C@H](CCC(N)=O)NC1=O)C(=O)N1CCC[C@H]1C(=O)N[C@@H](CCCNC(N)=N)C(=O)NCC(N)=O
Show InChI InChI=1S/C50H75N15O11S2/c1-3-27(2)41-47(75)61-32(15-16-37(51)66)43(71)62-34(23-38(52)67)44(72)63-35(48(76)65-20-10-14-36(65)46(74)60-31(13-9-19-56-49(54)55)42(70)57-25-39(53)68)26-77-78-50(17-7-4-8-18-50)24-40(69)59-33(45(73)64-41)22-29-21-28-11-5-6-12-30(28)58-29/h5-6,11-12,21,27,31-36,41,58H,3-4,7-10,13-20,22-26H2,1-2H3,(H2,51,66)(H2,52,67)(H2,53,68)(H,57,70)(H,59,69)(H,60,74)(H,61,75)(H,62,71)(H,63,72)(H,64,73)(H4,54,55,56)/t27-,31-,32-,33-,34+,35-,36-,41+/m0/s1
Reactome pathway
n/an/an/a 28.8n/an/an/an/an/a
Medical College of Ohio
Curated by ChEMBL
Assay Description
In vitro anti-oxytocic activity with 0.5 mM Mg2+.
J Med Chem 38: 1762-9 (1995)
BindingDB Entry DOI: 10.7270/Q24M95QZ
Vasopressin V2 Receptor
(Rattus norvegicus (Rat))
BDBM50407335
(CHEMBL428187)
Show SMILES CC[C@H](C)[C@H]1NC(=O)[C@H](Cc2cc3ccccc3[nH]2)NC(=O)CC2(CCCCC2)SSC[C@H](NC(=O)[C@@H](CC(N)=O)NC(=O)[C@H](CCC(N)=O)NC1=O)C(=O)N1CCC[C@H]1C(=O)N[C@@H](CCCNC(N)=N)C(=O)NCC(N)=O
Show InChI InChI=1S/C50H75N15O11S2/c1-3-27(2)41-47(75)61-32(15-16-37(51)66)43(71)62-34(23-38(52)67)44(72)63-35(48(76)65-20-10-14-36(65)46(74)60-31(13-9-19-56-49(54)55)42(70)57-25-39(53)68)26-77-78-50(17-7-4-8-18-50)24-40(69)59-33(45(73)64-41)22-29-21-28-11-5-6-12-30(28)58-29/h5-6,11-12,21,27,31-36,41,58H,3-4,7-10,13-20,22-26H2,1-2H3,(H2,51,66)(H2,52,67)(H2,53,68)(H,57,70)(H,59,69)(H,60,74)(H,61,75)(H,62,71)(H,63,72)(H,64,73)(H4,54,55,56)/t27-,31-,32-,33-,34+,35-,36-,41+/m0/s1
Reactome pathway
n/an/an/a>1.26E+3n/an/an/an/an/a
Medical College of Ohio
Curated by ChEMBL
Assay Description
Antidiuretic activity at V2 receptor
J Med Chem 38: 1762-9 (1995)
BindingDB Entry DOI: 10.7270/Q24M95QZ
AVPR1A
(RAT)
BDBM50407335
(CHEMBL428187)
Show SMILES CC[C@H](C)[C@H]1NC(=O)[C@H](Cc2cc3ccccc3[nH]2)NC(=O)CC2(CCCCC2)SSC[C@H](NC(=O)[C@@H](CC(N)=O)NC(=O)[C@H](CCC(N)=O)NC1=O)C(=O)N1CCC[C@H]1C(=O)N[C@@H](CCCNC(N)=N)C(=O)NCC(N)=O
Show InChI InChI=1S/C50H75N15O11S2/c1-3-27(2)41-47(75)61-32(15-16-37(51)66)43(71)62-34(23-38(52)67)44(72)63-35(48(76)65-20-10-14-36(65)46(74)60-31(13-9-19-56-49(54)55)42(70)57-25-39(53)68)26-77-78-50(17-7-4-8-18-50)24-40(69)59-33(45(73)64-41)22-29-21-28-11-5-6-12-30(28)58-29/h5-6,11-12,21,27,31-36,41,58H,3-4,7-10,13-20,22-26H2,1-2H3,(H2,51,66)(H2,52,67)(H2,53,68)(H,57,70)(H,59,69)(H,60,74)(H,61,75)(H,62,71)(H,63,72)(H,64,73)(H4,54,55,56)/t27-,31-,32-,33-,34+,35-,36-,41+/m0/s1
n/an/an/a 27.5n/an/an/an/an/a
Medical College of Ohio
Curated by ChEMBL
Assay Description
Anti-vasopressor activity at V1a receptor
J Med Chem 38: 1762-9 (1995)
BindingDB Entry DOI: 10.7270/Q24M95QZ