BDBM50407341 CHEMBL264449
SMILES: CCN1[C@@H](Cc2ccc(O)cc2)C(=O)N[C@H](Cc2ccccc2)C(=O)N[C@@H](C(C)C)C(=O)N[C@H](CC(N)=O)C(=O)N[C@H](CSSC2(CCCCC2)CC1=O)C(=O)N1CCC[C@H]1C(=O)N[C@@H](CCCNC(N)=N)C(=O)NCC(N)=O
InChI Key: InChIKey=WRLMWYFBMVMVFC-SRLQJIMUSA-N
Data: 4 Kd
Activity Spreadsheet -- Enzyme Inhibition Constant Data from BindingDB
Found 4 hits for monomerid = 50407341
Trg + Lig
Ki
nM
ΔG°
kcal/mole
IC50
nM
Kd
nM
EC50/IC50
nM
koff
s-1
kon
M-1s-1
pHTemp
°C
Oxytocin receptor
(RAT)
BDBM50407341
(CHEMBL264449)
Show SMILES CCN1[C@@H](Cc2ccc(O)cc2)C(=O)N[C@H](Cc2ccccc2)C(=O)N[C@@H](C(C)C)C(=O)N[C@H](CC(N)=O)C(=O)N[C@H](CSSC2(CCCCC2)CC1=O)C(=O)N1CCC[C@H]1C(=O)N[C@@H](CCCNC(N)=N)C(=O)NCC(N)=O
Show InChI InChI=1S/C53H77N13O11S2/c1-4-65-40(26-33-17-19-34(67)20-18-33)49(75)61-36(25-32-13-7-5-8-14-32)47(73)64-44(31(2)3)50(76)62-37(27-41(54)68)46(72)63-38(30-78-79-53(28-43(65)70)21-9-6-10-22-53)51(77)66-24-12-16-39(66)48(74)60-35(15-11-23-58-52(56)57)45(71)59-29-42(55)69/h5,7-8,13-14,17-20,31,35-40,44,67H,4,6,9-12,15-16,21-30H2,1-3H3,(H2,54,68)(H2,55,69)(H,59,71)(H,60,74)(H,61,75)(H,62,76)(H,63,72)(H,64,73)(H4,56,57,58)/t35-,36+,37+,38+,39-,40-,44-/m0/s1
Reactome pathway
n/an/an/a 26n/an/an/an/an/a
Medical College of Ohio
Curated by ChEMBL
Assay Description
In vitro activity for the anti-oxytocic activity with out Mg2+.
J Med Chem 38: 1762-9 (1995)
BindingDB Entry DOI: 10.7270/Q24M95QZ
Vasopressin V2 Receptor
(Rattus norvegicus (Rat))
BDBM50407341
(CHEMBL264449)
Show SMILES CCN1[C@@H](Cc2ccc(O)cc2)C(=O)N[C@H](Cc2ccccc2)C(=O)N[C@@H](C(C)C)C(=O)N[C@H](CC(N)=O)C(=O)N[C@H](CSSC2(CCCCC2)CC1=O)C(=O)N1CCC[C@H]1C(=O)N[C@@H](CCCNC(N)=N)C(=O)NCC(N)=O
Show InChI InChI=1S/C53H77N13O11S2/c1-4-65-40(26-33-17-19-34(67)20-18-33)49(75)61-36(25-32-13-7-5-8-14-32)47(73)64-44(31(2)3)50(76)62-37(27-41(54)68)46(72)63-38(30-78-79-53(28-43(65)70)21-9-6-10-22-53)51(77)66-24-12-16-39(66)48(74)60-35(15-11-23-58-52(56)57)45(71)59-29-42(55)69/h5,7-8,13-14,17-20,31,35-40,44,67H,4,6,9-12,15-16,21-30H2,1-3H3,(H2,54,68)(H2,55,69)(H,59,71)(H,60,74)(H,61,75)(H,62,76)(H,63,72)(H,64,73)(H4,56,57,58)/t35-,36+,37+,38+,39-,40-,44-/m0/s1
Reactome pathway
n/an/an/a 1.00E+3n/an/an/an/an/a
Medical College of Ohio
Curated by ChEMBL
Assay Description
Antidiuretic activity at V2 receptor
J Med Chem 38: 1762-9 (1995)
BindingDB Entry DOI: 10.7270/Q24M95QZ
Oxytocin receptor
(RAT)
BDBM50407341
(CHEMBL264449)
Show SMILES CCN1[C@@H](Cc2ccc(O)cc2)C(=O)N[C@H](Cc2ccccc2)C(=O)N[C@@H](C(C)C)C(=O)N[C@H](CC(N)=O)C(=O)N[C@H](CSSC2(CCCCC2)CC1=O)C(=O)N1CCC[C@H]1C(=O)N[C@@H](CCCNC(N)=N)C(=O)NCC(N)=O
Show InChI InChI=1S/C53H77N13O11S2/c1-4-65-40(26-33-17-19-34(67)20-18-33)49(75)61-36(25-32-13-7-5-8-14-32)47(73)64-44(31(2)3)50(76)62-37(27-41(54)68)46(72)63-38(30-78-79-53(28-43(65)70)21-9-6-10-22-53)51(77)66-24-12-16-39(66)48(74)60-35(15-11-23-58-52(56)57)45(71)59-29-42(55)69/h5,7-8,13-14,17-20,31,35-40,44,67H,4,6,9-12,15-16,21-30H2,1-3H3,(H2,54,68)(H2,55,69)(H,59,71)(H,60,74)(H,61,75)(H,62,76)(H,63,72)(H,64,73)(H4,56,57,58)/t35-,36+,37+,38+,39-,40-,44-/m0/s1
Reactome pathway
n/an/an/a 57.5n/an/an/an/an/a
Medical College of Ohio
Curated by ChEMBL
Assay Description
In vitro activity was determinedfor the anti-oxytocic activity with 0.5 mM Mg2+.
J Med Chem 38: 1762-9 (1995)
BindingDB Entry DOI: 10.7270/Q24M95QZ
AVPR1A
(RAT)
BDBM50407341
(CHEMBL264449)
Show SMILES CCN1[C@@H](Cc2ccc(O)cc2)C(=O)N[C@H](Cc2ccccc2)C(=O)N[C@@H](C(C)C)C(=O)N[C@H](CC(N)=O)C(=O)N[C@H](CSSC2(CCCCC2)CC1=O)C(=O)N1CCC[C@H]1C(=O)N[C@@H](CCCNC(N)=N)C(=O)NCC(N)=O
Show InChI InChI=1S/C53H77N13O11S2/c1-4-65-40(26-33-17-19-34(67)20-18-33)49(75)61-36(25-32-13-7-5-8-14-32)47(73)64-44(31(2)3)50(76)62-37(27-41(54)68)46(72)63-38(30-78-79-53(28-43(65)70)21-9-6-10-22-53)51(77)66-24-12-16-39(66)48(74)60-35(15-11-23-58-52(56)57)45(71)59-29-42(55)69/h5,7-8,13-14,17-20,31,35-40,44,67H,4,6,9-12,15-16,21-30H2,1-3H3,(H2,54,68)(H2,55,69)(H,59,71)(H,60,74)(H,61,75)(H,62,76)(H,63,72)(H,64,73)(H4,56,57,58)/t35-,36+,37+,38+,39-,40-,44-/m0/s1
n/an/an/a 64.6n/an/an/an/an/a
Medical College of Ohio
Curated by ChEMBL
Assay Description
Anti-vasopressor activity at V1a receptor
J Med Chem 38: 1762-9 (1995)
BindingDB Entry DOI: 10.7270/Q24M95QZ