BDBM50407344 CHEMBL261914
SMILES: CC[C@H](C)[C@H]1NC(=O)[C@H](Cc2ccc(O)cc2)N(C)C(=O)CC2(CCCCC2)SSC[C@@H](NC(=O)[C@@H](CC(N)=O)NC(=O)[C@H](CCC(N)=O)NC1=O)C(=O)N1CCC[C@H]1C(=O)N[C@@H](CCCN)C(=O)NCC(N)=O
InChI Key: InChIKey=FEIVHZFHJGKMRY-OUOUSVCESA-N
Data: 4 Kd
Activity Spreadsheet -- Enzyme Inhibition Constant Data from BindingDB
Found 4 hits for monomerid = 50407344
Trg + Lig
Ki
nM
ΔG°
kcal/mole
IC50
nM
Kd
nM
EC50/IC50
nM
koff
s-1
kon
M-1s-1
pHTemp
°C
Oxytocin receptor
(RAT)
BDBM50407344
(CHEMBL261914)
Show SMILES CC[C@H](C)[C@H]1NC(=O)[C@H](Cc2ccc(O)cc2)N(C)C(=O)CC2(CCCCC2)SSC[C@@H](NC(=O)[C@@H](CC(N)=O)NC(=O)[C@H](CCC(N)=O)NC1=O)C(=O)N1CCC[C@H]1C(=O)N[C@@H](CCCN)C(=O)NCC(N)=O
Show InChI InChI=1S/C48H74N12O12S2/c1-4-27(2)40-46(71)55-31(16-17-36(50)62)42(67)56-32(23-37(51)63)43(68)57-33(47(72)60-21-9-11-34(60)44(69)54-30(10-8-20-49)41(66)53-25-38(52)64)26-73-74-48(18-6-5-7-19-48)24-39(65)59(3)35(45(70)58-40)22-28-12-14-29(61)15-13-28/h12-15,27,30-35,40,61H,4-11,16-26,49H2,1-3H3,(H2,50,62)(H2,51,63)(H2,52,64)(H,53,66)(H,54,69)(H,55,71)(H,56,67)(H,57,68)(H,58,70)/t27-,30-,31-,32+,33+,34-,35-,40+/m0/s1
Reactome pathway
n/an/an/a 22n/an/an/an/an/a
Medical College of Ohio
Curated by ChEMBL
Assay Description
In vitro anti-oxytocic activity with out Mg2+.
J Med Chem 38: 1762-9 (1995)
BindingDB Entry DOI: 10.7270/Q24M95QZ
Oxytocin receptor
(RAT)
BDBM50407344
(CHEMBL261914)
Show SMILES CC[C@H](C)[C@H]1NC(=O)[C@H](Cc2ccc(O)cc2)N(C)C(=O)CC2(CCCCC2)SSC[C@@H](NC(=O)[C@@H](CC(N)=O)NC(=O)[C@H](CCC(N)=O)NC1=O)C(=O)N1CCC[C@H]1C(=O)N[C@@H](CCCN)C(=O)NCC(N)=O
Show InChI InChI=1S/C48H74N12O12S2/c1-4-27(2)40-46(71)55-31(16-17-36(50)62)42(67)56-32(23-37(51)63)43(68)57-33(47(72)60-21-9-11-34(60)44(69)54-30(10-8-20-49)41(66)53-25-38(52)64)26-73-74-48(18-6-5-7-19-48)24-39(65)59(3)35(45(70)58-40)22-28-12-14-29(61)15-13-28/h12-15,27,30-35,40,61H,4-11,16-26,49H2,1-3H3,(H2,50,62)(H2,51,63)(H2,52,64)(H,53,66)(H,54,69)(H,55,71)(H,56,67)(H,57,68)(H,58,70)/t27-,30-,31-,32+,33+,34-,35-,40+/m0/s1
Reactome pathway
n/an/an/a 36.3n/an/an/an/an/a
Medical College of Ohio
Curated by ChEMBL
Assay Description
In vitro anti-oxytocic activity with 0.5 mM Mg2+.
J Med Chem 38: 1762-9 (1995)
BindingDB Entry DOI: 10.7270/Q24M95QZ
AVPR1A
(RAT)
BDBM50407344
(CHEMBL261914)
Show SMILES CC[C@H](C)[C@H]1NC(=O)[C@H](Cc2ccc(O)cc2)N(C)C(=O)CC2(CCCCC2)SSC[C@@H](NC(=O)[C@@H](CC(N)=O)NC(=O)[C@H](CCC(N)=O)NC1=O)C(=O)N1CCC[C@H]1C(=O)N[C@@H](CCCN)C(=O)NCC(N)=O
Show InChI InChI=1S/C48H74N12O12S2/c1-4-27(2)40-46(71)55-31(16-17-36(50)62)42(67)56-32(23-37(51)63)43(68)57-33(47(72)60-21-9-11-34(60)44(69)54-30(10-8-20-49)41(66)53-25-38(52)64)26-73-74-48(18-6-5-7-19-48)24-39(65)59(3)35(45(70)58-40)22-28-12-14-29(61)15-13-28/h12-15,27,30-35,40,61H,4-11,16-26,49H2,1-3H3,(H2,50,62)(H2,51,63)(H2,52,64)(H,53,66)(H,54,69)(H,55,71)(H,56,67)(H,57,68)(H,58,70)/t27-,30-,31-,32+,33+,34-,35-,40+/m0/s1
n/an/an/a 56.2n/an/an/an/an/a
Medical College of Ohio
Curated by ChEMBL
Assay Description
Anti-vasopressor activity at V1a receptor
J Med Chem 38: 1762-9 (1995)
BindingDB Entry DOI: 10.7270/Q24M95QZ
Vasopressin V2 Receptor
(Rattus norvegicus (Rat))
BDBM50407344
(CHEMBL261914)
Show SMILES CC[C@H](C)[C@H]1NC(=O)[C@H](Cc2ccc(O)cc2)N(C)C(=O)CC2(CCCCC2)SSC[C@@H](NC(=O)[C@@H](CC(N)=O)NC(=O)[C@H](CCC(N)=O)NC1=O)C(=O)N1CCC[C@H]1C(=O)N[C@@H](CCCN)C(=O)NCC(N)=O
Show InChI InChI=1S/C48H74N12O12S2/c1-4-27(2)40-46(71)55-31(16-17-36(50)62)42(67)56-32(23-37(51)63)43(68)57-33(47(72)60-21-9-11-34(60)44(69)54-30(10-8-20-49)41(66)53-25-38(52)64)26-73-74-48(18-6-5-7-19-48)24-39(65)59(3)35(45(70)58-40)22-28-12-14-29(61)15-13-28/h12-15,27,30-35,40,61H,4-11,16-26,49H2,1-3H3,(H2,50,62)(H2,51,63)(H2,52,64)(H,53,66)(H,54,69)(H,55,71)(H,56,67)(H,57,68)(H,58,70)/t27-,30-,31-,32+,33+,34-,35-,40+/m0/s1
Reactome pathway
n/an/an/a 1.26E+3n/an/an/an/an/a
Medical College of Ohio
Curated by ChEMBL
Assay Description
Antidiuretic activity at V2 receptor
J Med Chem 38: 1762-9 (1995)
BindingDB Entry DOI: 10.7270/Q24M95QZ