BDBM50407420 CHEMBL90972
SMILES: CSCC[C@H](N)C(=O)NCC(O)=O
InChI Key: InChIKey=QXOHLNCNYLGICT-YFKPBYRVSA-N
Data: 1 IC50
Activity Spreadsheet -- Enzyme Inhibition Constant Data from BindingDB
Found 1 hit for monomerid = 50407420
Trg + Lig
Ki
nM
ΔG°
kcal/mole
IC50
nM
Kd
nM
EC50/IC50
nM
koff
s-1
kon
M-1s-1
pHTemp
°C
Angiotensin-converting enzyme
(Homo sapiens (Human))
BDBM50407420
(CHEMBL90972)
Show SMILES CSCC[C@H](N)C(=O)NCC(O)=O
Show InChI InChI=1S/C7H14N2O3S/c1-13-3-2-5(8)7(12)9-4-6(10)11/h5H,2-4,8H2,1H3,(H,9,12)(H,10,11)/t5-/m0/s1
Reactome pathway
n/an/a 4.79E+6n/an/an/an/an/an/a
University of Illinois at Chicago
Curated by ChEMBL
Assay Description
Biological activity was measured against Angiotensin I converting enzyme
J Med Chem 38: 2705-13 (1995)
BindingDB Entry DOI: 10.7270/Q2GX4CSN