BDBM50407423 CHEMBL90973
SMILES: NCC(=O)N[C@@H](CO)C(O)=O
InChI Key: InChIKey=BCCRXDTUTZHDEU-VKHMYHEASA-N
Data: 1 IC50
Activity Spreadsheet -- Enzyme Inhibition Constant Data from BindingDB
Found 1 hit for monomerid = 50407423
Trg + Lig
Ki
nM
ΔG°
kcal/mole
IC50
nM
Kd
nM
EC50/IC50
nM
koff
s-1
kon
M-1s-1
pHTemp
°C
Angiotensin-converting enzyme
(Homo sapiens (Human))
BDBM50407423
(CHEMBL90973)
Show SMILES NCC(=O)N[C@@H](CO)C(O)=O
Show InChI InChI=1S/C5H10N2O4/c6-1-4(9)7-3(2-8)5(10)11/h3,8H,1-2,6H2,(H,7,9)(H,10,11)/t3-/m0/s1
Reactome pathway
n/an/a 3.80E+6n/an/an/an/an/an/a
University of Illinois at Chicago
Curated by ChEMBL
Assay Description
Biological activity was measured against Angiotensin I converting enzyme
J Med Chem 38: 2705-13 (1995)
BindingDB Entry DOI: 10.7270/Q2GX4CSN