BDBM50407434 CHEMBL301979
SMILES: CC[C@H](C)[C@H](N)C(=O)NCC(O)=O
InChI Key: InChIKey=UCGDDTHMMVWVMV-FSPLSTOPSA-N
Data: 1 IC50
Activity Spreadsheet -- Enzyme Inhibition Constant Data from BindingDB
Found 1 hit for monomerid = 50407434
Trg + Lig
Ki
nM
ΔG°
kcal/mole
IC50
nM
Kd
nM
EC50/IC50
nM
koff
s-1
kon
M-1s-1
pHTemp
°C
Angiotensin-converting enzyme
(Homo sapiens (Human))
BDBM50407434
(CHEMBL301979)
Show SMILES CC[C@H](C)[C@H](N)C(=O)NCC(O)=O
Show InChI InChI=1S/C8H16N2O3/c1-3-5(2)7(9)8(13)10-4-6(11)12/h5,7H,3-4,9H2,1-2H3,(H,10,13)(H,11,12)/t5-,7-/m0/s1
Reactome pathway
n/an/a 1.20E+6n/an/an/an/an/an/a
University of Illinois at Chicago
Curated by ChEMBL
Assay Description
Biological activity was measured against Angiotensin I converting enzyme
J Med Chem 38: 2705-13 (1995)
BindingDB Entry DOI: 10.7270/Q2GX4CSN