BDBM50407441 CHEMBL91160
SMILES: N[C@@H](CCCNC(N)=N)C(=O)N[C@@H](Cc1c[nH]c2ccccc12)C(O)=O
InChI Key: InChIKey=QADCERNTBWTXFV-JSGCOSHPSA-N
Data: 2 IC50
Activity Spreadsheet -- Enzyme Inhibition Constant Data from BindingDB
Found 2 hits for monomerid = 50407441
Trg + Lig
Ki
nM
ΔG°
kcal/mole
IC50
nM
Kd
nM
EC50/IC50
nM
koff
s-1
kon
M-1s-1
pHTemp
°C
Angiotensin-converting enzyme
(Homo sapiens (Human))
BDBM50407441
(CHEMBL91160)
Show SMILES N[C@@H](CCCNC(N)=N)C(=O)N[C@@H](Cc1c[nH]c2ccccc12)C(O)=O
Show InChI InChI=1S/C17H24N6O3/c18-12(5-3-7-21-17(19)20)15(24)23-14(16(25)26)8-10-9-22-13-6-2-1-4-11(10)13/h1-2,4,6,9,12,14,22H,3,5,7-8,18H2,(H,23,24)(H,25,26)(H4,19,20,21)/t12-,14-/m0/s1
Reactome pathway
n/an/a 1.58E+4n/an/an/an/an/an/a
University of Illinois at Chicago
Curated by ChEMBL
Assay Description
Biological activity was measured against Angiotensin I converting enzyme
J Med Chem 38: 2705-13 (1995)
BindingDB Entry DOI: 10.7270/Q2GX4CSN
Angiotensin-converting enzyme
(Homo sapiens (Human))
BDBM50407441
(CHEMBL91160)
Show SMILES N[C@@H](CCCNC(N)=N)C(=O)N[C@@H](Cc1c[nH]c2ccccc12)C(O)=O
Show InChI InChI=1S/C17H24N6O3/c18-12(5-3-7-21-17(19)20)15(24)23-14(16(25)26)8-10-9-22-13-6-2-1-4-11(10)13/h1-2,4,6,9,12,14,22H,3,5,7-8,18H2,(H,23,24)(H,25,26)(H4,19,20,21)/t12-,14-/m0/s1
Reactome pathway
n/an/a 1.58E+4n/an/an/an/an/an/a
Tianjin University
Curated by ChEMBL
Assay Description
Inhibition of ACE (unknown origin)
Eur J Med Chem 84: 100-6 (2014)
Article DOI: 10.1016/j.ejmech.2014.07.015
BindingDB Entry DOI: 10.7270/Q29025F2