BDBM50407444 CHEMBL301546::Val-Gly
SMILES: CC(C)[C@H](N)C(=O)NCC(O)=O
InChI Key: InChIKey=IOUPEELXVYPCPG-LURJTMIESA-N
Data: 1 IC50
Activity Spreadsheet -- Enzyme Inhibition Constant Data from BindingDB
Found 1 hit for monomerid = 50407444
Trg + Lig
Ki
nM
ΔG°
kcal/mole
IC50
nM
Kd
nM
EC50/IC50
nM
koff
s-1
kon
M-1s-1
pHTemp
°C
Angiotensin-converting enzyme
(Homo sapiens (Human))
BDBM50407444
(CHEMBL301546 | Val-Gly)
Show SMILES CC(C)[C@H](N)C(=O)NCC(O)=O
Show InChI InChI=1S/C7H14N2O3/c1-4(2)6(8)7(12)9-3-5(10)11/h4,6H,3,8H2,1-2H3,(H,9,12)(H,10,11)/t6-/m0/s1
Reactome pathway
n/an/a 1.10E+6n/an/an/an/an/an/a
University of Illinois at Chicago
Curated by ChEMBL
Assay Description
Biological activity was measured against Angiotensin I converting enzyme
J Med Chem 38: 2705-13 (1995)
BindingDB Entry DOI: 10.7270/Q2GX4CSN