BDBM50407510 CHEMBL121644::TCMDC-137179
SMILES: Nc1nc(N)c2c(Sc3ccc(F)cc3)cccc2n1
InChI Key: InChIKey=DSDJGZZQAUENDD-UHFFFAOYSA-N
Data: 2 IC50
Activity Spreadsheet -- Enzyme Inhibition Constant Data from BindingDB
Found 2 hits for monomerid = 50407510
Trg + Lig
Ki
nM
ΔG°
kcal/mole
IC50
nM
Kd
nM
EC50/IC50
nM
koff
s-1
kon
M-1s-1
pHTemp
°C
Dihydrofolate reductase
(Homo sapiens (Human))
BDBM50407510
(CHEMBL121644 | TCMDC-137179)
Show SMILES Nc1nc(N)c2c(Sc3ccc(F)cc3)cccc2n1
Show InChI InChI=1S/C14H11FN4S/c15-8-4-6-9(7-5-8)20-11-3-1-2-10-12(11)13(16)19-14(17)18-10/h1-7H,(H4,16,17,18,19)
NCI pathway
Reactome pathway
n/an/a 2.00E+3n/an/an/an/an/an/a
Burroughs Wellcome Company
Curated by ChEMBL
Assay Description
In vitro inhibition of human dihydrofolate reductase
J Med Chem 38: 3608-16 (1995)
BindingDB Entry DOI: 10.7270/Q2V69KS6
Dihydrofolate Reductase (DHFR)
(Candida albicans)
BDBM50407510
(CHEMBL121644 | TCMDC-137179)
Show SMILES Nc1nc(N)c2c(Sc3ccc(F)cc3)cccc2n1
Show InChI InChI=1S/C14H11FN4S/c15-8-4-6-9(7-5-8)20-11-3-1-2-10-12(11)13(16)19-14(17)18-10/h1-7H,(H4,16,17,18,19)
n/an/a 50n/an/an/an/an/an/a
Burroughs Wellcome Company
Curated by ChEMBL
Assay Description
Inhibition of dihydrofolate reductase in Candida albicans (in vitro).
J Med Chem 38: 3608-16 (1995)
BindingDB Entry DOI: 10.7270/Q2V69KS6