BDBM50407997 CHEMBL2112859
SMILES: CCCn1ccc2cc3N(CCc3cc12)C(=O)Nc1cccnc1
InChI Key: InChIKey=YWHQPNSSLZNZSS-UHFFFAOYSA-N
Data: 1 KI  1 Kd
Activity Spreadsheet -- Enzyme Inhibition Constant Data from BindingDB
Found 2 hits for monomerid = 50407997
Trg + Lig
Ki
nM
ΔG°
kcal/mole
IC50
nM
Kd
nM
EC50/IC50
nM
koff
s-1
kon
M-1s-1
pHTemp
°C
Serotonin receptor 2a and 2c (5HT2A and 5HT2C)
(Rattus norvegicus (Rat))
BDBM50407997
(CHEMBL2112859)
Show SMILES CCCn1ccc2cc3N(CCc3cc12)C(=O)Nc1cccnc1
Show InChI InChI=1S/C19H20N4O/c1-2-8-22-9-5-14-12-18-15(11-17(14)22)6-10-23(18)19(24)21-16-4-3-7-20-13-16/h3-5,7,9,11-13H,2,6,8,10H2,1H3,(H,21,24)
12.6n/an/an/an/an/an/an/an/a
SmithKline Beecham Pharmaceuticals
Curated by ChEMBL
Assay Description
Displacement of [3H]mesulergine from rat 5-HT2C receptor expressed in HEK293
J Med Chem 39: 4966-77 (1997)
Article DOI: 10.1021/jm960571v
BindingDB Entry DOI: 10.7270/Q2S75HJF
Serotonin receptor 2a and 2b (5HT2A and 5HT2B)
(RAT)
BDBM50407997
(CHEMBL2112859)
Show SMILES CCCn1ccc2cc3N(CCc3cc12)C(=O)Nc1cccnc1
Show InChI InChI=1S/C19H20N4O/c1-2-8-22-9-5-14-12-18-15(11-17(14)22)6-10-23(18)19(24)21-16-4-3-7-20-13-16/h3-5,7,9,11-13H,2,6,8,10H2,1H3,(H,21,24)
n/an/an/a 7.94n/an/an/an/an/a
SmithKline Beecham Pharmaceuticals
Curated by ChEMBL
Assay Description
Inhibition of 5-HT binding to 5-HT2B receptor of Rat stomach fundus
J Med Chem 39: 4966-77 (1997)
Article DOI: 10.1021/jm960571v
BindingDB Entry DOI: 10.7270/Q2S75HJF