BDBM50408167 CHEMBL53416
SMILES: C(N1CCN(CC1)c1nc2ccccc2n2cccc12)c1ccccc1
InChI Key: InChIKey=PADMFNVKWGURLR-UHFFFAOYSA-N
Data: 6 IC50
Activity Spreadsheet -- Enzyme Inhibition Constant Data from BindingDB
Found 6 hits for monomerid = 50408167
Trg + Lig
Ki
nM
ΔG°
kcal/mole
IC50
nM
Kd
nM
EC50/IC50
nM
koff
s-1
kon
M-1s-1
pHTemp
°C
Serotonin 3a (5-HT3a)/3b (5-HT3b)/3c (5-HT3c)/3d (5-HT3d)/3e (5-HT3e) receptor
(Homo sapiens (Human))
BDBM50408167
(CHEMBL53416)
Show SMILES C(N1CCN(CC1)c1nc2ccccc2n2cccc12)c1ccccc1
Show InChI InChI=1S/C22H22N4/c1-2-7-18(8-3-1)17-24-13-15-25(16-14-24)22-21-11-6-12-26(21)20-10-5-4-9-19(20)23-22/h1-12H,13-17H2
n/an/a 0.355n/an/an/an/an/an/a
Universit£ de Caen
Curated by ChEMBL
Assay Description
Binding affinity against 5-hydroxytryptamine 3 receptor was measured using [3H]granisetron as radioligand
J Med Chem 40: 1808-19 (1997)
Article DOI: 10.1021/jm960501o
BindingDB Entry DOI: 10.7270/Q20R9QMC
5-hydroxytryptamine receptor 2C
(Homo sapiens (Human))
BDBM50408167
(CHEMBL53416)
Show SMILES C(N1CCN(CC1)c1nc2ccccc2n2cccc12)c1ccccc1
Show InChI InChI=1S/C22H22N4/c1-2-7-18(8-3-1)17-24-13-15-25(16-14-24)22-21-11-6-12-26(21)20-10-5-4-9-19(20)23-22/h1-12H,13-17H2
Reactome pathway
n/an/a 2.45E+3n/an/an/an/an/an/a
Universit£ de Caen
Curated by ChEMBL
Assay Description
Binding affinity against 5-Hydroxytryptamine 2C Receptor was measured using [3H]N-methyl-mesulergine as radioligand
J Med Chem 40: 1808-19 (1997)
Article DOI: 10.1021/jm960501o
BindingDB Entry DOI: 10.7270/Q20R9QMC
Serotonin 1B/1D receptor
(Rattus norvegicus (Rat))
BDBM50408167
(CHEMBL53416)
Show SMILES C(N1CCN(CC1)c1nc2ccccc2n2cccc12)c1ccccc1
Show InChI InChI=1S/C22H22N4/c1-2-7-18(8-3-1)17-24-13-15-25(16-14-24)22-21-11-6-12-26(21)20-10-5-4-9-19(20)23-22/h1-12H,13-17H2
Reactome pathway
n/an/a 1.29E+4n/an/an/an/an/an/a
Universit£ de Caen
Curated by ChEMBL
Assay Description
Binding affinity towards 5-hydroxytryptamine 1B receptor was measured using [3H]5-HT as radioligand
J Med Chem 40: 1808-19 (1997)
Article DOI: 10.1021/jm960501o
BindingDB Entry DOI: 10.7270/Q20R9QMC
5-hydroxytryptamine receptor 1A
(Homo sapiens (Human))
BDBM50408167
(CHEMBL53416)
Show SMILES C(N1CCN(CC1)c1nc2ccccc2n2cccc12)c1ccccc1
Show InChI InChI=1S/C22H22N4/c1-2-7-18(8-3-1)17-24-13-15-25(16-14-24)22-21-11-6-12-26(21)20-10-5-4-9-19(20)23-22/h1-12H,13-17H2
n/an/a 2.57E+3n/an/an/an/an/an/a
Universit£ de Caen
Curated by ChEMBL
Assay Description
Binding affinity against 5-hydroxytryptamine 1A receptor was measured using [3H]8-OH-DPAT as radioligand
J Med Chem 40: 1808-19 (1997)
Article DOI: 10.1021/jm960501o
BindingDB Entry DOI: 10.7270/Q20R9QMC
Serotonin 1d (5-HT1d) receptor
(Sus scrofa)
BDBM50408167
(CHEMBL53416)
Show SMILES C(N1CCN(CC1)c1nc2ccccc2n2cccc12)c1ccccc1
Show InChI InChI=1S/C22H22N4/c1-2-7-18(8-3-1)17-24-13-15-25(16-14-24)22-21-11-6-12-26(21)20-10-5-4-9-19(20)23-22/h1-12H,13-17H2
n/an/a 2.40E+4n/an/an/an/an/an/a
Universit£ de Caen
Curated by ChEMBL
Assay Description
Binding affinity against 5-hydroxytryptamine 1D receptor was measured using [3H]5-HT as radioligand
J Med Chem 40: 1808-19 (1997)
Article DOI: 10.1021/jm960501o
BindingDB Entry DOI: 10.7270/Q20R9QMC
Serotonin 2a (5-HT2a) receptor
(BOVINE)
BDBM50408167
(CHEMBL53416)
Show SMILES C(N1CCN(CC1)c1nc2ccccc2n2cccc12)c1ccccc1
Show InChI InChI=1S/C22H22N4/c1-2-7-18(8-3-1)17-24-13-15-25(16-14-24)22-21-11-6-12-26(21)20-10-5-4-9-19(20)23-22/h1-12H,13-17H2
Reactome pathway
n/an/a 1.05E+4n/an/an/an/an/an/a
Universit£ de Caen
Curated by ChEMBL
Assay Description
Binding affinity against 5-hydroxytryptamine 2A receptor was measured using [3H]ketanserin as radioligand
J Med Chem 40: 1808-19 (1997)
Article DOI: 10.1021/jm960501o
BindingDB Entry DOI: 10.7270/Q20R9QMC