BDBM50408543 CHEMBL336118
SMILES: Fc1ccc(cc1)C1CC2CCC1N2
InChI Key: InChIKey=GXRHSMGIBFOLIQ-UHFFFAOYSA-N
Data: 1 Kd
Activity Spreadsheet -- Enzyme Inhibition Constant Data from BindingDB
Found 1 hit for monomerid = 50408543
Trg + Lig
Ki
nM
ΔG°
kcal/mole
IC50
nM
Kd
nM
EC50/IC50
nM
koff
s-1
kon
M-1s-1
pHTemp
°C
Cholinergic, Nicotinic Muscle
(RAT)
BDBM50408543
(CHEMBL336118)
Show SMILES Fc1ccc(cc1)C1CC2CCC1N2 |THB:4:7:13:11.10|
Show InChI InChI=1S/C12H14FN/c13-9-3-1-8(2-4-9)11-7-10-5-6-12(11)14-10/h1-4,10-12,14H,5-7H2
Reactome pathway
n/an/an/a 0.0370n/an/an/an/an/a
National Institute on Drug Abuse
Curated by ChEMBL
Assay Description
The compound was tested for the inhibition of binding of [3H]epibatidine to central nicotinic acetylcholine receptor (nAChR) in rat brain.
J Med Chem 41: 4199-206 (1998)
Article DOI: 10.1021/jm980233p
BindingDB Entry DOI: 10.7270/Q2FT8N7Z