BDBM50408786 CHEMBL148476
SMILES: NCc1ccc(N)cc1
InChI Key: InChIKey=BFWYZZPDZZGSLJ-UHFFFAOYSA-N
Data: 1 KI  1 IC50
PDB links: 1 PDB ID matches this monomer.
Activity Spreadsheet -- Enzyme Inhibition Constant Data from BindingDB
Found 2 hits for monomerid = 50408786
Trg + Lig
Ki
nM
ΔG°
kcal/mole
IC50
nM
Kd
nM
EC50/IC50
nM
koff
s-1
kon
M-1s-1
pHTemp
°C
Trypsin-1
(Homo sapiens (Human))
BDBM50408786
(CHEMBL148476)
Show SMILES NCc1ccc(N)cc1
Show InChI InChI=1S/C7H10N2/c8-5-6-1-3-7(9)4-2-6/h1-4H,5,8-9H2
Reactome pathway
5.00E+8n/an/an/an/an/an/an/an/a
Czech Academy of Sciences
Curated by ChEMBL
Assay Description
The compound was tested for inhibition of the proteolytic enzyme trypsin.
J Med Chem 42: 5169-80 (2000)
BindingDB Entry DOI: 10.7270/Q2930VD5
Lysyl oxidase homolog 2
(Homo sapiens (Human))
BDBM50408786
(CHEMBL148476)
Show SMILES NCc1ccc(N)cc1
Show InChI InChI=1S/C7H10N2/c8-5-6-1-3-7(9)4-2-6/h1-4H,5,8-9H2
n/an/a 4.70E+4n/an/an/an/an/an/a
PharmAkea Inc.
Curated by ChEMBL
Assay Description
Inhibition of full length recombinant human LOXL2 expressed in CHO cells assessed as reduction in H2O2 production using DAP as substrate preincubated...
ACS Med Chem Lett 8: 423-427 (2017)
BindingDB Entry DOI: 10.7270/Q2542QV6