BDBM50408953 CHEMBL320186
SMILES: CCc1c(C)c(C)[nH]c1\C=C1\C(=O)Nc2ccccc12
InChI Key: InChIKey=HKJUJLRPOAIDLV-NTEUORMPSA-N
Data: 1 IC50
Activity Spreadsheet -- Enzyme Inhibition Constant Data from BindingDB
Found 1 hit for monomerid = 50408953
Trg + Lig
Ki
nM
ΔG°
kcal/mole
IC50
nM
Kd
nM
EC50/IC50
nM
koff
s-1
kon
M-1s-1
pHTemp
°C
Vascular endothelial growth factor receptor 2
(Mus musculus)
BDBM50408953
(CHEMBL320186)
Show SMILES CCc1c(C)c(C)[nH]c1\C=C1\C(=O)Nc2ccccc12
Show InChI InChI=1S/C17H18N2O/c1-4-12-10(2)11(3)18-16(12)9-14-13-7-5-6-8-15(13)19-17(14)20/h5-9,18H,4H2,1-3H3,(H,19,20)/b14-9+
Reactome pathway
n/an/a 141n/an/an/an/an/an/a
Eli Lilly and Company
Curated by ChEMBL
Assay Description
Inhibitory activity against vascular endothelial growth factor receptor 2 (FLK1)
J Med Chem 43: 3020-32 (2000)
BindingDB Entry DOI: 10.7270/Q2HM59P2